program: Gaussian 09
title: 000093960
version: EM64L-G09RevD.01
frameworkgroup: C1[X(C11H21NO2)]
method: RPBEPBE
basis: SDD
operation: Freq
keyword: #p
keyword: freq=noraman
keyword: PBEPBE/SDD
title: #p freq=noraman PBEPBE/SDD
converged: YES YES NO NO
title: Mulliken charges:
elementType: O O N C C C C C C C C C C C H H H H H H H H H H H H H H H H H H H H H
charge: -0.269667 -0.234142 -0.385599 0.295887 0.300860 -0.178804 -0.468804 -0.455978 -0.718125 -0.742917 -0.742881 -0.716352 0.184360 -0.504440 0.255308 0.238578 0.200643 0.208193 0.225256 0.238629 0.213981 0.212417 0.204862 0.206851 0.238394 0.201316 0.237990 0.206272 0.203240 0.214779 0.205078 0.212366 0.241360 0.239435 0.231653
chargesum: 0.00000
title: Mulliken charges with hydrogens summed into heavy atoms:
elementType: O O N C C C C C C C C C C C
charge: -0.269667 -0.234142 -0.146970 0.295887 0.300860 0.076504 -0.029582 -0.022529 -0.086865 -0.096355 -0.095379 -0.084130 0.184360 0.208008
polarizability: 1.48301284e+02 -1.92364949e+00 1.31241464e+02 -2.25045114e+00 2.51994553e+00 1.15063628e+02
1716.lowfreq: -9.9151 -0.0010 -0.0004 0.0000 2.7856 6.5898 10.5054 75.3646 87.7634
frequency: 9.5865 75.3513 87.7618 101.9555 118.1800 131.0170 173.5313 198.3584 216.1005 231.2337 234.6660 245.8050 256.2161 276.9761 297.9500 307.1388 323.0399 340.1255 394.8505 402.0750 437.8002 444.3254 474.7958 488.8774 555.5462 563.7642 675.5444 691.1306 765.4194 784.7665 856.8041 867.7312 881.2760 894.7698 905.7016 914.9830 927.8469 942.3402 976.9831 986.0525 996.6453 1017.3183 1038.2815 1081.4950 1092.5992 1112.2900 1121.9667 1147.5552 1164.2340 1178.3103 1195.3612 1202.4979 1240.9940 1274.8940 1286.1085 1292.2472 1299.4113 1323.1069 1358.1878 1362.5106 1370.4622 1380.9704 1387.9175 1421.2425 1434.8636 1446.4201 1451.7499 1453.7710 1455.9494 1460.7449 1464.3875 1464.9695 1468.1086 1478.1858 1480.9150 1487.7879 1494.0525 1641.1876 2969.3925 2970.0799 2973.7860 2975.9889 2990.6029 2998.1528 3002.6694 3023.7673 3054.2499 3058.0400 3059.9170 3065.1221 3066.4257 3068.5824 3082.2973 3091.4662 3092.5110 3094.4991 3103.4433 3147.0304 3438.0575
redmass: 5.2908 3.2239 1.4036 2.0209 2.5192 2.4738 1.0800 3.6218 1.2318 2.0405 1.7265 1.5777 2.3479 1.8618 1.5354 2.6170 3.6042 2.4581 2.2516 2.5668 1.5364 1.9617 2.9361 3.0576 2.6346 2.5629 5.2182 5.9702 3.6408 3.2347 2.7778 1.7169 2.4734 2.7958 1.4882 1.6421 1.9347 2.3673 1.7325 1.3069 1.9178 1.8654 1.7864 1.5050 2.8753 1.2759 3.0684 1.4415 2.1370 2.9190 2.4202 2.9433 2.2099 2.3303 1.4191 1.6285 1.4951 1.3394 1.5896 1.2097 1.2159 1.2185 1.2100 1.1864 1.1962 1.0927 1.0504 1.0733 1.0501 1.0621 1.0505 1.0597 1.0592 1.0598 1.0561 1.1452 1.0624 9.0428 1.0362 1.0363 1.0364 1.0370 1.0585 1.0601 1.0296 1.0838 1.1028 1.0993 1.0993 1.0989 1.0996 1.0987 1.0989 1.0986 1.0993 1.0973 1.1044 1.1047 1.0742
irintensity: 1.7344 0.2514 0.4509 0.1466 0.0615 1.6392 0.3813 6.7826 1.0561 0.6598 3.5483 1.9360 2.0653 1.8770 1.4542 3.1210 15.3443 0.3146 0.3775 1.3223 50.0509 11.5955 0.8985 5.5117 45.0677 19.3232 10.0025 2.0276 1.5757 2.2235 6.4566 1.0616 0.7921 3.8000 2.8442 4.0466 0.2623 29.3636 4.1276 1.1704 14.0071 0.9362 10.6317 4.8670 29.2666 0.3977 252.2895 5.8326 22.0737 43.8955 11.2424 21.1145 42.7172 16.8815 29.8494 46.5977 68.1622 3.7730 4.0091 0.6263 47.8552 36.0409 11.3077 20.6248 16.4410 0.2758 13.6600 2.2422 0.4008 2.8634 11.9046 14.0024 15.8754 6.9487 1.7180 7.0270 21.2543 154.5061 12.7156 35.7531 34.4240 45.1723 26.2577 18.0576 37.3134 4.2512 3.8714 2.8862 3.8579 55.0642 57.2786 74.5918 23.0111 66.8485 41.4467 22.4660 27.5664 16.9465 4.2128
temp: 298.150 k
press: 1.00000 atm
elementType: 8 8 7 6 6 6 6 6 6 6 6 6 6 6 1 1 1 1 1 1 1 1 1 1 1 1 1 1 1 1 1 1 1 1 1
symmnumber: 1
zpe: 800386.4 jmol-1
zpe.correction: 0.304851 hartree
zpe.thermalcorrener: 0.321424 hartree
zpe.thermalcorrenthalpy: 0.322368 hartree
zpe.thermalcorrgfe: 0.260915 hartree
zpe.sumelectzpe: -635.828632 hartree
zpe.sumelectthermal: -635.812059 hartree
zpe.sumelectthermalent: -635.811115 hartree
zpe.sumelectthermalfe: -635.872568 hartree
dipole: 0.3994 1.0578 1.9085
dipole: 2.2183
quadrupole: -76.2722 -86.0465 -93.1082
quadrupole: -2.9052 -3.0982 -3.1335
quadrupole: 8.8701 -0.9042 -7.9659 -2.9052 -3.0982 -3.1335
hfenergy: -636.1334832 hartree
pointgroup: C01 [X(C11H21N1O2)]
dipole: -0.1625865 -0.4392553 0.7364052 debye
polarizability: 148.2749266|-1.7642611|131.3291684|2.6905214|-2.0529697|115.0022818 unknown
InChI: InChI=1S/C11H21NO2/c1-10(2)6-8(9(13)14-5)7-11(3,4)12-10/h8,12H,6-7H2,1-5H3
charge 0 multiplicity 1
35 atoms
O  3.008122 -0.277254 0.747377
O  2.588358 0.895664 -1.219825
N  -2.092047 -0.180404 -0.446593
C  -1.663021 1.143778 0.083859
C  -1.331399 -1.434513 -0.191733
C  0.699404 0.116411 0.189133
C  -0.154605 1.33312 -0.235508
C  0.163949 -1.165302 -0.515601
C  -1.929478 1.348564 1.611786
C  -2.47643 2.212624 -0.690513
C  -1.874624 -2.490117 -1.18957
C  -1.485727 -2.012391 1.253527
C  2.156901 0.316942 -0.19617
C  4.456929 -0.203605 0.437582
H  0.668171 -0.031081 1.284113
H  -0.02798 1.480293 -1.323801
H  0.207522 2.25041 0.266441
H  0.764957 -2.044086 -0.215458
H  0.26982 -1.030222 -1.609179
H  -3.108099 -0.319807 -0.367118
H  -1.294691 0.702596 2.241628
H  -1.73352 2.398383 1.902066
H  -2.98575 1.12248 1.851924
H  -2.162934 3.233109 -0.403298
H  -2.329546 2.084791 -1.776671
H  -3.558759 2.118848 -0.473917
H  -1.80068 -2.107074 -2.221847
H  -1.307897 -3.43626 -1.1141
H  -2.938544 -2.717002 -0.980876
H  -1.011197 -1.37458 2.018225
H  -2.55691 -2.11007 1.512597
H  -1.026241 -3.016753 1.321359
H  4.780693 0.848734 0.37059
H  4.670061 -0.706278 -0.521034
H  4.94999 -0.718249 1.274208
