program: Gaussian 09
title: 000093917
version: EM64L-G09RevD.01
frameworkgroup: C1[X(C7H10O5)]
method: RPBEPBE
basis: SDD
operation: Freq
keyword: #pfreq=noraman
keyword: PBEPBE/SDD
title: #p freq=noraman PBEPBE/SDD
converged: YES YES NO NO
title: Mulliken charges:
elementType: O O O O O C C C C C C C H H H H H H H H H H
charge: -0.254797 -0.258119 -0.227933 -0.235948 -0.164735 -0.241208 -0.556540 0.261914 0.298518 -0.049673 -0.504084 -0.504424 0.278079 0.270928 0.248262 0.178802 0.240356 0.236813 0.252563 0.254640 0.241584 0.235003
chargesum: 0.00000
title: Mulliken charges with hydrogens summed into heavy atoms:
elementType: O O O O O C C C C C C C
charge: -0.254797 -0.258119 -0.227933 -0.235948 -0.164735 0.036871 -0.037350 0.261914 0.298518 0.129128 0.225648 0.226802
polarizability: 1.11506230e+02 6.17740425e+00 8.59654504e+01 -2.57190720e+00 -1.27170687e-01 7.57163888e+01
1716.lowfreq: -7.4982 0.0003 0.0006 0.0009 3.6758 8.0289 34.4719 48.1518 66.6020
frequency: 34.4173 48.1442 66.6013 89.4976 94.3561 101.6401 114.7080 161.6550 181.7323 205.4116 219.9247 261.2881 293.7030 325.7658 357.0741 480.1965 530.2135 568.9122 611.9124 705.0245 734.1835 776.4557 831.5958 863.4821 925.5200 942.5039 969.5285 1033.8153 1072.4812 1112.9895 1114.5777 1132.8954 1150.3573 1152.6325 1162.5918 1204.2141 1223.1576 1291.0288 1348.7123 1390.1475 1422.6721 1423.9776 1444.5777 1453.1567 1454.1334 1462.5549 1463.3457 1631.5807 1633.9945 1654.1038 2898.0665 2995.5130 3007.9324 3009.0107 3009.2454 3099.8793 3113.7694 3113.9460 3155.4848 3156.0339
redmass: 4.8502 5.2455 6.2543 1.3099 1.4311 2.2766 3.4423 4.1464 3.2168 5.1484 4.0204 3.7532 3.2557 4.9796 3.9047 5.7762 3.8583 4.0065 5.6315 4.2771 3.8037 4.8876 3.5547 2.9450 5.0396 5.0477 2.5341 2.4781 2.0801 1.2886 1.2700 2.4271 1.4601 1.4632 2.1353 1.6988 1.7066 1.9020 1.6423 1.2485 1.2024 1.2148 1.0874 1.0494 1.0496 1.0505 1.0504 8.8917 9.0497 9.3395 1.0874 1.0765 1.0693 1.0296 1.0314 1.0949 1.1049 1.1049 1.1052 1.1050
irintensity: 3.0501 2.2608 1.4330 1.4090 1.5366 1.1037 1.4313 4.5275 10.6431 6.8128 2.9296 22.3629 19.1817 19.7417 7.2842 12.3487 10.3658 2.5129 7.5872 7.0975 2.6307 10.2596 3.7864 53.2566 8.6511 10.6548 12.1954 34.0290 11.7732 8.3809 0.1831 264.2255 23.2420 39.6173 97.6875 111.8223 20.9300 91.2646 85.5612 5.9952 21.1209 23.5822 27.5090 15.3028 15.4752 9.0748 14.0345 187.9701 270.5644 87.4025 105.7881 5.6659 8.1887 31.2267 25.7111 3.9435 20.4408 22.2598 16.7399 14.0392
temp: 298.150 k
press: 1.00000 atm
elementType: 8 8 8 8 8 6 6 6 6 6 6 6 1 1 1 1 1 1 1 1 1 1
symmnumber: 1
zpe: 433574.7 jmol-1
zpe.correction: 0.165140 hartree
zpe.thermalcorrener: 0.178994 hartree
zpe.thermalcorrenthalpy: 0.179938 hartree
zpe.thermalcorrgfe: 0.123010 hartree
zpe.sumelectzpe: -647.905990 hartree
zpe.sumelectthermal: -647.892136 hartree
zpe.sumelectthermalent: -647.891192 hartree
zpe.sumelectthermalfe: -647.948120 hartree
dipole: -1.0348 -1.3796 3.2402
dipole: 3.6706
quadrupole: -55.9156 -71.2586 -69.6681
quadrupole: -5.6845 2.2028 8.4945
quadrupole: 9.6985 -5.6445 -4.0540 -5.6845 2.2028 8.4945
hfenergy: -648.0711296 hartree
pointgroup: C01 [X(C7H10O5)]
dipole: -0.3471041 0.7608584 -1.1773091 debye
dipolederiv: -1.4976328 -0.0338829 -0.0109235 0.0466356 -0.3571077 -0.0982352 -0.0006059 -0.1355792 -0.3528305 -0.8697944 0.5366167 0.1753325 0.6633811 -0.9749711 -0.1186751 0.1614647 -0.0520328 -0.4758449 -0.7718753 -0.0116944 0.0002573 0.2623037 -0.6706884 -0.1999101 0.1655133 -0.321986 -0.4094208 -0.600192 0.1493188 0.1542585 0.3430287 -0.7769013 0.0842712 -0.0307935 0.3555773 -0.615357 -0.5405544 0.2895053 -0.1792674 0.1135642 -0.6252322 0.1388074 -0.2138385 0.3758583 -0.4881315 -0.0801567 -0.2888781 -0.0145235 -0.2462172 -0.4791756 0.1152932 -0.0595247 0.1888289 -0.0832299 -0.0135732 0.0623123 0.100095 0.0706957 -0.0045621 -0.0469916 0.1410412 -0.0641009 -0.1226588 1.7306329 0.1187816 -0.0806871 -0.2829609 0.7629534 0.3525622 -0.1942372 0.5622421 0.3815984 0.9492825 -0.5279094 -0.2802057 -0.838256 1.3247794 -0.0294107 -0.0131359 -0.4105852 0.7599092 0.730343 -0.1412307 0.2059579 0.0339161 1.097786 -0.3008151 0.1189855 -0.528764 0.5139251 0.570835 0.0727199 0.0703563 0.1661393 0.2726419 0.0025276 0.1576167 0.0074201 0.2722821 0.4614297 -0.1536706 -0.1067653 -0.1004791 0.3361682 0.0892298 -0.2009582 0.1757241 0.3421894 0.05578 0.0339883 0.0579379 0.0366702 0.0768921 -0.0286037 0.0381426 -0.0633174 0.014018 0.0754132 0.0062879 0.0299039 0.0042284 -0.0127311 0.0975999 0.0292941 0.0510356 0.0604085 -0.0094846 -0.0495859 -0.0341125 -0.0780488 0.0321423 -0.1004557 -0.0202283 -0.0550902 0.0410501 -0.1677378 -0.1452524 -0.1028909 -0.1240957 -0.0687048 -0.011071 -0.0776301 -0.0318488 0.0204119 0.0348461 0.0291984 -0.0352913 -0.082238 -0.1039974 0.0372826 -0.0581154 0.0464102 0.0669049 -0.0933995 0.0384239 0.0307376 0.0782134 0.0774861 -0.0368665 0.0551559 -0.0391678 0.0891643 0.0360387 -0.0332298 0.0493934 -0.061308 0.0741503 0.0286391 -0.0533526 0.0153987 -0.0929876 -0.020841 -0.0109314 -0.088206 -0.0010008 0.0902956 -0.0207316 -0.0072341 -0.0883326 -0.0443411 -0.0199928 -0.04065 0.0533846 -0.1289052 -0.0230739 0.024042 0.0832911 -0.043976 0.0465903 0.0406335 0.0997624 0.0052583 0.1247332 -0.0481497 0.0215114 -0.0208507 0.0562857 0.0763497 unknown
polarizability: 107.3883555|-11.3838041|90.0858783|-0.8413214|1.6347893|75.7138356 unknown
InChI: InChI=1S/C7H10O5/c1-11-6(9)3-5(4-8)7(10)12-2/h4-5H,3H2,1-2H3
charge 0 multiplicity 1
22 atoms
O  2.765116 0.078182 -0.549406
O  -2.400438 1.588807 -0.178829
O  1.105412 1.423528 0.383916
O  -1.664594 -0.326558 0.921934
O  1.115163 -2.278355 0.600521
C  0.498382 -0.505953 -1.035948
C  -0.856794 0.164471 -1.350291
C  1.448653 0.448195 -0.322374
C  -1.648945 0.430291 -0.078336
C  0.310421 -1.825901 -0.236114
C  3.790969 0.836853 0.210238
C  -3.205254 1.938605 1.020348
H  0.978721 -0.818773 -1.986055
H  -0.721345 1.105206 -1.906288
H  -1.460082 -0.511606 -1.988018
H  -0.60545 -2.390598 -0.540051
H  3.727203 1.911315 -0.030123
H  4.749995 0.410027 -0.112979
H  3.634669 0.690941 1.291519
H  -2.534246 2.118932 1.876066
H  -3.901323 1.119378 1.266157
H  -3.745232 2.852314 0.737214
