program: Gaussian 09
title: 000093911
version: EM64L-G09RevD.01
frameworkgroup: C1[X(C11H14BrNO)]
method: RPBEPBE
basis: SDD
operation: Freq
keyword: #p
keyword: freq=noraman
keyword: PBEPBE/SDD
title: #p freq=noraman PBEPBE/SDD
converged: YES YES NO NO
title: Mulliken charges:
elementType: Br O N C C C C C C C C C C C H H H H H H H H H H H H H H
charge: -0.002636 -0.485657 -0.219124 0.182181 -0.450705 -0.455008 -0.489272 -0.488859 0.419767 -0.390464 -0.395709 -0.209161 -0.172205 -0.219784 0.235853 0.206190 0.204518 0.236500 0.236786 0.203310 0.201180 0.237262 0.254127 0.337244 0.227773 0.299507 0.247767 0.248618
chargesum: 0.00000
title: Mulliken charges with hydrogens summed into heavy atoms:
elementType: Br O N C C C C C C C C C C C
charge: -0.002636 -0.148413 0.035002 0.182181 -0.008662 -0.013990 -0.049176 -0.050417 0.419767 -0.162692 -0.096202 0.038606 0.076413 -0.219784
polarizability: 2.12295734e+02 -1.16631333e-01 1.23145688e+02 5.64887712e-01 1.48499861e-01 8.86129807e+01
1716.lowfreq: -21.1075 -8.9005 -6.3677 -0.0007 -0.0007 -0.0006 29.7147 58.0856 78.5984
frequency: 29.2821 58.0291 78.5687 155.9565 169.0053 173.1609 191.1127 218.2118 273.8612 307.9888 327.6777 348.6637 395.9268 405.5916 412.3918 465.2157 492.0262 531.7584 535.4920 596.1824 624.7939 671.0564 705.7872 718.7310 777.6554 818.9947 840.7522 842.5101 874.5064 908.1575 939.2702 950.1709 967.7469 985.9267 992.0372 997.6795 1017.2440 1062.0768 1094.5531 1104.3814 1136.4958 1146.0665 1149.6778 1166.5474 1188.7025 1236.6186 1250.6957 1272.2569 1291.1420 1310.2700 1312.9334 1333.6634 1352.1544 1358.4835 1367.4776 1385.3048 1429.9649 1443.5871 1447.6952 1460.1266 1463.9803 1471.0721 1578.1393 1596.0116 2950.0932 2954.9675 2986.8511 2990.6585 3047.7335 3050.4152 3055.5653 3058.8192 3125.6866 3161.6792 3166.0614 3188.3156 3443.6063 3572.5359
redmass: 4.6271 4.6331 4.7603 2.6683 3.1397 1.5517 9.3472 2.0079 4.4317 3.2491 4.1205 2.0158 3.9025 2.8975 2.9796 3.5933 3.4281 2.8242 2.2652 1.6843 7.1164 3.1964 4.8157 3.6591 1.5541 1.4321 2.4176 1.3469 3.3106 2.3080 2.7763 1.3783 1.5744 1.3615 3.4699 2.6126 2.6315 2.4789 2.4448 1.5051 1.8657 1.7410 1.9624 2.0086 1.1586 1.3793 1.3543 1.6742 1.2593 1.3324 1.3030 1.2714 1.6350 1.5054 3.6460 3.5601 1.0996 1.1116 1.1286 1.1059 1.0925 2.3392 7.6922 6.2738 1.0691 1.0690 1.0597 1.0602 1.0937 1.0943 1.1021 1.1026 1.0889 1.0900 1.0952 1.0948 1.0748 1.0655
irintensity: 0.3010 0.2851 1.7444 26.5282 22.4983 81.9224 0.2738 2.4185 5.5569 1.6946 6.6227 18.1580 14.6354 0.0525 0.0575 17.5838 0.1008 28.3198 8.5044 157.0188 0.9616 80.6138 1.7532 1.1860 1.7967 38.5518 5.4123 28.0527 46.0374 0.2197 15.5958 0.2663 9.4750 2.4960 54.6069 20.8990 9.4871 22.1840 0.3257 15.5466 44.9871 44.7872 16.9712 24.0802 1.6865 4.8349 3.2348 7.8934 0.7055 3.8744 0.2173 5.1527 33.3341 2.7839 11.6290 13.0656 12.8129 7.8276 0.0447 12.1031 23.5583 85.3084 1.2413 8.0735 42.3985 57.9772 16.0455 25.7760 65.1752 11.8537 1.9613 56.0660 17.1594 4.2846 5.0421 1.9752 0.7418 1.8402
temp: 298.150 k
press: 1.00000 atm
elementType: 35 8 7 6 6 6 6 6 6 6 6 6 6 6 1 1 1 1 1 1 1 1 1 1 1 1 1 1
symmnumber: 1
zpe: 597906.7 jmol-1
zpe.correction: 0.227731 hartree
zpe.thermalcorrener: 0.241077 hartree
zpe.thermalcorrenthalpy: 0.242021 hartree
zpe.thermalcorrgfe: 0.186568 hartree
zpe.sumelectzpe: -569.937379 hartree
zpe.sumelectthermal: -569.924033 hartree
zpe.sumelectthermalent: -569.923089 hartree
zpe.sumelectthermalfe: -569.978542 hartree
dipole: -2.9266 -1.5451 0.0151
dipole: 3.3094
quadrupole: -101.3544 -86.3546 -93.6082
quadrupole: 2.7867 0.2230 0.0753
quadrupole: -7.5820 7.4178 0.1642 2.7867 0.2230 0.0753
hfenergy: -570.16511 hartree
pointgroup: C01 [X(C11H14Br1N1O1)]
dipole: -1.1676011 -0.3638897 -0.4467346 debye
polarizability: 212.1701783|-3.6398939|103.1366065|-0.2669814|17.0481715|108.7476186 unknown
InChI: InChI=1S/C11H14BrNO/c12-10-3-1-9(2-4-10)11(14)5-7-13-8-6-11/h1-4,13-14H,5-8H2
charge 0 multiplicity 1
28 atoms
Br 5.204029 -0.294575 -0.219475
O  -1.332128 1.251881 1.31659
N  -3.861386 -0.491706 -0.620085
C  -1.082425 0.271205 0.230501
C  -1.722312 -1.098492 0.618946
C  -1.716742 0.797966 -1.092753
C  -3.275125 -1.024149 0.631549
C  -3.270526 0.806118 -1.021821
C  0.441449 0.152386 0.120138
C  1.023916 -0.695859 -0.856159
C  1.296856 0.867091 0.992914
C  2.425056 -0.832653 -0.965419
C  2.70217 0.741541 0.899944
C  3.249401 -0.10881 -0.080036
H  -1.336833 -1.396669 1.612175
H  -1.40156 -1.869421 -0.108393
H  -1.397339 0.152691 -1.933711
H  -1.329217 1.815709 -1.288125
H  -3.698982 -2.025655 0.825389
H  -3.614804 -0.379785 1.470079
H  -3.611897 1.576618 -0.297526
H  -3.690219 1.101935 -1.999849
H  -3.831744 -1.180843 -1.383614
H  -2.309506 1.375326 1.411765
H  0.391574 -1.265345 -1.547649
H  0.850943 1.522098 1.744608
H  2.862392 -1.489686 -1.722572
H  3.353357 1.297284 1.580889
