program: Gaussian 09
title: 000093898
version: EM64L-G09RevD.01
frameworkgroup: C1[X(C6H5ClFN)]
method: RPBEPBE
basis: SDD
operation: Freq
keyword: #p
keyword: freq=noraman
keyword: PBEPBE/SDD
title: #p freq=noraman PBEPBE/SDD
converged: NO NO NO YES
title: Mulliken charges:
elementType: Cl F N C C C C C C H H H H H
charge: -0.065842 -0.220546 -0.681406 0.303686 0.211477 -0.342109 -0.318585 -0.200452 -0.086385 0.229653 0.276497 0.251589 0.311783 0.330639
chargesum: 0.00000
title: Mulliken charges with hydrogens summed into heavy atoms:
elementType: Cl F N C C C C C C
charge: -0.065842 -0.220546 -0.038984 0.303686 0.211477 -0.112456 -0.042088 0.051138 -0.086385
polarizability: 1.25234604e+02 -4.77405408e+00 8.03560915e+01 -1.52418083e-02 3.09870163e-03 3.21624142e+01
1716.lowfreq: -10.2184 -0.0025 -0.0023 -0.0019 5.9569 11.8097 118.2323 206.9898 219.2951
frequency: 118.2314 206.9863 219.2949 274.3515 319.0176 357.1153 366.4100 428.2002 440.0837 450.3208 537.4021 555.9395 631.6695 693.3926 767.0589 795.9258 846.9720 857.7640 921.1726 1011.9093 1060.2154 1137.1480 1169.6141 1248.6870 1328.7273 1381.8371 1420.2315 1502.4943 1580.5831 1618.1880 1646.6844 3137.9933 3172.6319 3183.0846 3571.5360 3713.6455
redmass: 6.1398 6.6228 10.1380 4.5658 3.4458 12.5105 1.3008 2.2273 5.0062 1.2749 5.7241 4.4292 7.7036 3.7988 5.4221 1.4757 1.3874 6.6002 1.3239 1.6817 1.8245 1.6998 2.1193 1.4324 2.4375 5.0913 5.1354 3.9370 7.4361 1.6587 2.5971 1.0893 1.0957 1.0936 1.0449 1.1045
irintensity: 1.1964 0.9050 0.4444 5.4653 23.4612 5.8943 142.8510 58.0441 2.0385 121.7648 1.5107 14.8083 18.8039 0.0379 27.5641 48.8556 34.4730 35.4013 0.2098 4.9710 9.9292 57.5018 21.0256 5.1616 32.3944 11.1702 5.1009 275.5920 12.6477 21.5351 190.7416 11.9743 3.4523 0.5976 102.6243 36.7080
temp: 298.150 k
press: 1.00000 atm
elementType: 17 9 7 6 6 6 6 6 6 1 1 1 1 1
symmnumber: 1
zpe: 255238.3 jmol-1
zpe.correction: 0.097215 hartree
zpe.thermalcorrener: 0.105342 hartree
zpe.thermalcorrenthalpy: 0.106286 hartree
zpe.thermalcorrgfe: 0.064276 hartree
zpe.sumelectzpe: -845.645385 hartree
zpe.sumelectthermal: -845.637259 hartree
zpe.sumelectthermalent: -845.636314 hartree
zpe.sumelectthermalfe: -845.678325 hartree
dipole: -3.1430 2.2009 0.0014
dipole: 3.8369
quadrupole: -52.2778 -52.8961 -62.2681
quadrupole: -5.4578 -0.0042 0.0025
quadrupole: 3.5362 2.9179 -6.4541 -5.4578 -0.0042 0.0025
hfenergy: -845.7426005 hartree
pointgroup: C01 [X(C6H5Cl1F1N1)]
dipole: -1.191278 0.9271597 0.0005378 debye
dipolederiv: -0.795673 0.1339742 0.00015 0.1419375 -0.1631929 -0.0000319 0.0001768 -0.0000393 -0.06934 -0.5998422 -0.3998009 0.0000777 -0.4226764 -0.6841819 0.0000612 0.0000581 0.000075 -0.1424391 -1.5562893 0.2322604 0.0000229 0.2411256 -0.1571931 0.0001161 -0.0002032 0.0001591 -0.7405535 1.5531756 -0.2815477 -0.0001321 -0.4137052 -0.1426467 0.0000087 -0.0001412 -0.000018 0.1195308 0.3243411 0.3127129 -0.0000869 0.8022124 0.7337011 -0.0001041 0.0000107 -0.0000579 0.0198225 -0.2635538 0.1850193 0.0000064 -0.2124649 0.1023757 0.0000399 -0.0000396 -0.0000001 -0.2141087 -0.1505596 0.0686596 0.0000554 0.0531301 -0.061321 -0.0000191 0.0000541 -0.0000246 -0.085304 -0.1385925 -0.085383 0.0000342 0.0812259 0.0769916 -0.0000003 0.0000533 0.0000219 -0.0987516 0.9872347 -0.1805374 -0.0002597 -0.2737532 0.0268843 0.0000616 -0.0003115 0.0000668 -0.121221 0.0188565 0.0850248 0.0000286 0.0679316 -0.0717326 -0.0000262 0.0000132 -0.0000266 0.1748098 0.1090594 0.0304246 0.0000109 0.0236826 0.0163387 -0.0000046 0.0000086 -0.0000073 0.1865381 0.0332606 -0.0785604 0.0000137 -0.074731 0.0226897 0.0000002 0.0000223 -0.0000057 0.1696209 0.2183983 -0.028998 0.0000317 -0.06616 0.144028 -0.0000686 0.0001718 -0.0001278 0.3977864 0.2601841 0.0067518 0.0000471 0.0522451 0.1572588 -0.0000328 0.0001266 -0.0000157 0.4036095 unknown
polarizability: 124.6393276|-7.0108735|80.9513677|-0.0150661|0.0038637|32.1624142 unknown
InChI: InChI=1S/C6H5ClFN/c7-4-1-2-6(9)5(8)3-4/h1-3H,9H2
charge 0 multiplicity 1
14 atoms
Cl 3.330294 -0.402781 -0.000568
F  -1.694195 -1.829862 0.000308
N  -2.615629 0.766809 0.000414
C  -1.245166 0.543951 0.00027
C  -0.736992 -0.784378 0.000153
C  -0.276892 1.58808 0.000187
C  0.623878 -1.102668 -0.000067
C  1.106557 1.305989 -0.000028
C  1.543261 -0.033324 -0.000162
H  -0.613655 2.630898 0.000297
H  0.945243 -2.147373 -0.00012
H  1.834224 2.122525 -0.000071
H  -2.991359 1.709537 0.000856
H  -3.25787 -0.020503 0.000531
