program: Gaussian 09
title: 000093971
version: EM64L-G09RevD.01
frameworkgroup: C1[X(C12H22O11)]
method: RPBEPBE
basis: SDD
operation: Freq
keyword: #p
keyword: freq=noraman
keyword: PBEPBE/SDD
title: #p freq=noraman PBEPBE/SDD
converged: NO YES NO NO
title: Mulliken charges:
elementType: O O O O O O O O O O O C C C C C C C C C C C C H H H H H H H H H H H H H H H H H H H H H H
charge: -0.275882 -0.300571 -0.294277 -0.488462 -0.495283 -0.483027 -0.445435 -0.463374 -0.458576 -0.437993 -0.475482 -0.073261 -0.175010 -0.187347 0.211504 -0.061677 -0.208113 -0.157081 -0.281170 -0.102234 -0.035756 -0.357223 -0.402360 0.244170 0.256523 0.280311 0.232803 0.268938 0.256063 0.247468 0.205899 0.217568 0.327223 0.206830 0.236795 0.222107 0.263564 0.361681 0.392016 0.390782 0.359176 0.366047 0.368315 0.369822 0.373987
chargesum: 0.00000
title: Mulliken charges with hydrogens summed into heavy atoms:
elementType: O O O O O O O O O O O C C C C C C C C C C C C
charge: -0.275882 -0.300571 -0.294277 -0.126782 -0.103267 -0.092244 -0.086259 -0.097327 -0.090261 -0.068172 -0.101495 0.170909 0.081514 0.092964 0.211504 0.171127 0.060825 0.098982 0.172197 0.115334 0.291468 0.086402 0.083311
polarizability: 1.81086679e+02 -4.19778180e+00 1.68760143e+02 -5.28829239e-01 -9.67317674e-01 1.41548120e+02
1716.lowfreq: -9.0560 -4.8576 -0.0003 0.0006 0.0010 9.6527 38.3583 46.1052 56.1419
frequency: 38.1110 46.0803 56.0676 60.2032 83.4006 101.7708 105.9720 125.4517 134.4011 142.8402 166.4606 180.7404 189.6361 209.7995 213.5763 233.2602 237.7846 249.0245 277.4886 293.8387 299.2190 316.8004 323.3010 340.9408 351.9143 370.8045 388.2189 397.6527 408.8828 414.5419 416.0305 423.5195 430.3889 445.6032 476.4156 504.1649 519.7544 524.5281 554.1792 564.7512 569.0850 637.9646 642.1942 665.7255 679.1311 721.3253 731.9762 759.6147 792.7971 832.4116 847.2989 858.1341 921.4530 939.3953 942.5636 949.0001 960.8623 985.8467 991.3383 1003.2576 1006.6480 1011.8985 1013.9994 1023.1585 1026.9714 1045.8540 1049.2399 1062.5415 1069.9282 1071.6169 1109.5418 1119.3188 1119.6689 1126.8798 1160.1577 1180.0186 1199.0211 1202.8654 1213.0872 1220.9968 1228.0009 1236.4258 1245.0603 1265.5615 1279.4215 1295.6143 1305.1128 1307.5697 1309.0320 1311.1769 1313.8007 1320.2038 1324.9082 1339.1542 1347.3516 1354.0014 1370.4291 1376.7903 1387.0674 1390.9305 1392.8536 1400.8701 1416.0437 1419.8453 1462.1287 1466.2612 1468.3767 2954.7621 2955.4825 2961.0399 2984.0833 2999.6875 3001.1386 3023.2705 3025.6103 3048.0455 3054.8250 3068.8340 3072.0715 3106.1428 3123.2994 3221.3461 3348.9137 3498.3347 3508.7604 3548.5298 3549.0307 3556.2762 3589.1919
redmass: 6.7354 6.5114 7.9082 5.0344 6.1725 5.9345 5.1571 4.7671 5.5486 5.4738 5.3505 5.4583 4.7769 4.1723 3.6672 4.5608 3.9623 5.1820 3.1420 1.3201 3.6205 4.3271 3.9669 3.2287 2.6657 2.6465 4.9942 2.6472 1.5273 1.7356 1.6993 2.6887 3.2446 3.2575 1.3210 1.5801 3.0724 3.0771 3.6920 4.6485 3.5764 2.2689 1.4620 1.8616 1.8926 5.9507 5.0952 4.6098 2.8044 3.8216 3.7767 3.2578 4.4957 5.1135 3.5076 4.3062 4.3349 3.4268 2.9425 4.4370 5.0382 2.2410 3.8457 3.3152 3.0283 2.3653 2.6296 4.0387 2.7419 2.7937 2.9979 1.9668 2.0201 2.4783 1.4860 1.3949 1.3286 1.2487 1.2919 1.3164 1.2402 1.2568 1.2929 1.4172 1.3345 1.1712 1.3061 1.2668 1.2024 1.2228 1.1898 1.2933 1.2583 1.2155 1.3522 1.4119 1.3538 1.3179 1.2742 1.2681 1.4131 1.1930 1.5670 1.6095 1.0848 1.0858 1.0809 1.0820 1.0715 1.0642 1.0849 1.0842 1.0716 1.0871 1.0841 1.0865 1.0890 1.0982 1.0865 1.0910 1.0984 1.0726 1.0665 1.0645 1.0649 1.0655 1.0651 1.0656 1.0668
irintensity: 1.1903 1.5029 2.7463 3.1889 2.5708 0.4499 3.4024 5.6276 8.0124 3.5735 4.1085 2.7076 9.9025 10.5307 1.3485 4.3071 19.1632 10.4131 12.6961 117.0093 6.8023 14.3720 12.2603 8.1214 23.1591 21.4893 8.7255 31.3198 11.6295 199.4773 84.8623 10.9673 21.1633 64.2978 161.1280 121.2160 42.3576 26.4597 20.9405 14.3392 32.3497 27.9603 79.2727 96.4119 176.4102 12.0286 29.2475 171.0261 44.5366 27.6057 28.3269 67.3721 22.2180 46.5187 173.1840 139.9065 105.2395 35.6433 61.4065 81.7613 5.0234 3.7599 88.7466 39.4010 64.8935 88.4068 71.8141 89.5689 28.5648 36.1374 30.2374 34.5381 29.2299 20.4828 20.6097 20.3734 21.0976 24.5064 26.2515 4.9421 9.8169 70.5698 14.2082 6.4885 8.7567 16.7214 28.5484 27.2659 5.8258 6.8594 0.6299 36.8714 11.8837 26.1772 10.7336 2.2793 27.0197 10.6207 19.6620 8.8302 13.5834 203.1318 12.5451 7.7759 3.1071 14.5074 7.1619 26.1811 58.1654 48.0492 39.7642 54.2175 34.7253 42.6259 5.3035 26.1203 36.7662 7.3849 22.3538 16.1085 8.1088 533.4589 165.6309 24.8678 22.2115 34.8779 2.1133 21.7892 15.1520
temp: 298.150 k
press: 1.00000 atm
elementType: 8 8 8 8 8 8 8 8 8 8 8 6 6 6 6 6 6 6 6 6 6 6 6 1 1 1 1 1 1 1 1 1 1 1 1 1 1 1 1 1 1 1 1 1 1
symmnumber: 1
zpe: 936765.6 jmol-1
zpe.correction: 0.356795 hartree
zpe.thermalcorrener: 0.380735 hartree
zpe.thermalcorrenthalpy: 0.381679 hartree
zpe.thermalcorrgfe: 0.305275 hartree
zpe.sumelectzpe: -1296.001884 hartree
zpe.sumelectthermal: -1295.977945 hartree
zpe.sumelectthermalent: -1295.977000 hartree
zpe.sumelectthermalfe: -1296.053405 hartree
dipole: 0.1639 -6.4554 1.4104
dipole: 6.6097
quadrupole: -138.5993 -133.9323 -138.2669
quadrupole: -15.6240 -4.4859 6.7127
quadrupole: -1.6665 3.0006 -1.3341 -15.6240 -4.4859 6.7127
hfenergy: -1296.3586795 hartree
pointgroup: C01 [X(C12H22O11)]
dipole: -0.2034694 -2.3399426 -1.1160843 debye
polarizability: 181.5367226|2.9232745|166.4330056|2.0808661|6.8499971|143.4252137 unknown
InChI: InChI=1S/C12H22O11/c13-1-4-6(15)8(17)9(18)11(22-4)21-2-5-7(16)10(19)12(20,3-14)23-5/h4-11,13-20H,1-3H2
charge 0 multiplicity 1
45 atoms
O  -1.34944 -0.183286 0.668654
O  0.793422 -1.794716 -0.369256
O  1.732723 0.086767 -1.579957
O  -4.111724 -1.767025 -0.008374
O  -2.36731 0.842992 -1.91694
O  -3.530673 0.316232 1.631613
O  3.250224 -2.765311 0.362223
O  4.36263 -0.332498 1.659984
O  2.76133 2.045036 1.420166
O  -2.085576 2.401975 2.292743
O  0.016937 2.204933 -1.958169
C  -1.614926 -1.448577 -0.075207
C  -2.978363 -1.2336 -0.802207
C  -3.136782 0.310757 -0.805959
C  -2.57387 0.665129 0.596792
C  1.928683 -1.286902 -1.144652
C  3.147746 -1.41499 -0.20616
C  3.094796 -0.362648 0.922899
C  -0.4944 -1.715805 -1.08406
C  2.884322 1.050802 0.35773
C  1.571375 1.049263 -0.436956
C  -2.214515 2.138058 0.869158
C  1.207172 2.378271 -1.093565
H  -1.675022 -2.270293 0.665502
H  -3.000173 -1.633049 -1.831251
H  -4.194958 0.605468 -0.910054
H  2.05737 -1.85768 -2.083633
H  4.072967 -1.274631 -0.790046
H  2.253898 -0.604016 1.60768
H  -0.464069 -0.898385 -1.825702
H  -0.67933 -2.681317 -1.600754
H  3.738705 1.29616 -0.311783
H  0.737726 0.699465 0.201052
H  -3.010305 2.767739 0.415946
H  -1.248998 2.39501 0.409902
H  2.047769 2.769365 -1.69908
H  0.938087 3.118933 -0.326894
H  -4.08317 -2.754825 0.018939
H  -1.592294 1.428955 -1.645225
H  -3.982113 -0.543627 1.383442
H  2.330699 -3.025199 0.639725
H  4.560988 -1.255007 1.965129
H  3.48797 1.873412 2.073784
H  -2.772988 1.841808 2.745326
H  0.282262 1.578258 -2.680507
