program: Gaussian 09
title: 000093878
version: EM64L-G09RevD.01
frameworkgroup: C1[X(C9H7Br3)]
method: RPBEPBE
basis: SDD
operation: Freq
keyword: #pfreq=noraman
keyword: PBEPBE/SDD
title: #p freq=noraman PBEPBE/SDD
converged: YES YES NO NO
title: Mulliken charges:
elementType: Br Br Br C C C C C C C C C H H H H H H H
charge: 0.031183 0.065250 0.076376 0.435092 0.337467 -0.418589 -0.328879 -0.162116 -0.136325 -0.184717 -0.790031 -0.661603 0.283428 0.279510 0.235167 0.245781 0.230490 0.228785 0.233731
chargesum: 0.00000
title: Mulliken charges with hydrogens summed into heavy atoms:
elementType: Br Br Br C C C C C C C C C
charge: 0.031183 0.065250 0.076376 0.435092 0.337467 -0.418589 -0.045452 -0.162116 0.143185 -0.184717 -0.078593 -0.199087
polarizability: 2.15131554e+02 -4.27215287e+00 1.54053337e+02 2.70440368e+00 -7.55905176e+00 7.50109543e+01
1716.lowfreq: -4.9958 -0.0004 -0.0003 -0.0002 5.0168 7.0073 37.0117 49.3531 92.1533
frequency: 36.9633 49.3225 92.1525 117.3870 128.0409 135.9832 161.8772 168.1470 202.0941 234.9029 248.3054 338.8901 385.2949 402.6749 438.2873 464.1971 561.7223 580.7515 614.7954 664.0558 701.1816 731.3719 793.5999 875.1762 899.6768 931.2436 950.3303 1002.3403 1011.1209 1051.9573 1107.8702 1129.7637 1249.0056 1256.1760 1321.0584 1343.9515 1394.6529 1415.6155 1434.2053 1458.9930 1476.9765 1520.1961 1564.4401 1655.4490 2977.1100 3058.6962 3093.9497 3096.8366 3169.1064 3179.7589 3202.5951
redmass: 6.1707 3.7437 5.7992 34.4784 6.8520 5.9421 1.1451 4.1328 40.8994 6.6434 5.7299 4.8941 4.7845 4.8743 4.4213 3.5892 2.7893 4.1880 6.6917 7.0718 2.1700 1.5417 7.6556 1.4294 1.4105 2.1995 1.3406 2.7236 1.8648 1.4985 2.6308 2.1699 1.1866 5.3339 4.6097 10.0547 1.2008 1.5599 1.8009 1.0578 1.0679 9.2120 7.8175 5.1175 1.0373 1.0959 1.0989 1.0637 1.0921 1.0930 1.1149
irintensity: 0.0937 0.0742 0.3060 0.0874 0.1392 0.4314 0.5529 0.1901 0.0208 1.0408 0.2138 0.5847 2.2485 3.6631 14.5784 13.1421 6.6837 24.9447 0.2825 0.1299 2.4136 5.4957 19.8233 4.2212 28.5712 20.3955 41.9218 83.1159 52.2277 4.6269 32.7992 13.7975 0.2920 28.3592 43.0566 5.1037 29.6175 42.2156 61.1824 12.1267 27.0445 0.2100 9.7008 16.4091 23.7296 12.9264 25.7841 2.5658 0.2021 0.1886 19.7398
temp: 298.150 k
press: 1.00000 atm
elementType: 35 35 35 6 6 6 6 6 6 6 6 6 1 1 1 1 1 1 1
symmnumber: 1
zpe: 335434.4 jmol-1
zpe.correction: 0.127760 hartree
zpe.thermalcorrener: 0.140784 hartree
zpe.thermalcorrenthalpy: 0.141728 hartree
zpe.thermalcorrgfe: 0.084862 hartree
zpe.sumelectzpe: -386.646747 hartree
zpe.sumelectthermal: -386.633723 hartree
zpe.sumelectthermalent: -386.632779 hartree
zpe.sumelectthermalfe: -386.689646 hartree
dipole: -1.5155 1.1867 0.3931
dipole: 1.9646
quadrupole: -97.4678 -92.2349 -99.4927
quadrupole: -4.5522 -1.8629 -0.1622
quadrupole: -1.0693 4.1635 -3.0942 -4.5522 -1.8629 -0.1622
hfenergy: -386.7745071 hartree
pointgroup: C01 [X(C9H7Br3)]
dipole: -0.7168426 0.2544917 0.1371472 debye
dipolederiv: -0.3592213 -0.3004527 0.0414406 -0.3586042 -0.4173717 0.0375844 0.0479361 0.0409833 -0.0213537 -0.2934155 -0.3014817 0.0457139 -0.3689221 -0.3741913 0.0607149 0.0623273 0.0655401 -0.0037507 -0.6225413 0.1709512 -0.0258225 0.2283293 -0.0589894 0.0096373 -0.0265773 0.0109371 0.0122729 0.084544 -0.3020872 0.1009603 -0.1193494 -0.1253541 0.0221968 0.0523301 0.0071927 -0.0419462 0.2339888 -0.1324217 -0.0520688 -0.1529665 -0.0164193 -0.0617174 -0.048177 -0.0506932 0.2966479 0.5116592 0.6120202 -0.0800351 0.5891575 0.7190469 -0.1004091 -0.043278 -0.0922913 -0.1186998 -0.1722549 -0.0511911 -0.0062373 -0.121084 -0.1740981 0.0325051 0.0131953 0.0296183 -0.0836527 0.222458 0.762425 -0.1301633 0.5975709 0.6133064 -0.1179443 -0.0838577 -0.1389608 -0.0501721 -0.47661 -0.0167073 -0.0079762 -0.1314388 -0.1912363 0.0292852 0.0017415 0.0246263 -0.0282963 0.9621074 -0.581114 0.0860212 -0.3433623 -0.0244662 -0.0085537 0.0471402 0.0008329 -0.1030673 -0.0850186 0.0566651 0.0460383 0.0782539 0.0214222 0.016189 0.0029293 0.051155 -0.1133169 -0.1229003 -0.0594179 -0.1072064 -0.0805415 -0.3258204 0.0024212 -0.0367351 -0.0346649 -0.1708518 0.0580104 0.0310122 -0.0024686 0.021917 -0.0050724 0.0192473 -0.0035559 0.0285619 0.1303968 0.0727957 0.008472 -0.0046507 0.0206812 0.0070608 0.0222087 -0.0046097 0.0162761 0.1537743 0.0622705 -0.0935264 -0.055345 -0.0470087 0.0363788 -0.1117345 -0.0459617 -0.0569123 -0.0413629 0.1385744 0.0019618 0.0262085 -0.0392584 -0.0553598 0.1079801 -0.0301293 0.0612357 0.0524763 -0.158623 0.0819724 0.0213901 0.0939502 0.0811711 -0.0010523 -0.0268384 0.0143665 0.0681703 -0.0988476 0.0949602 0.0006911 0.1311093 0.1197149 0.0290078 0.0243283 0.0118491 0.0911571 0.0430243 0.0179598 0.1035099 0.0015666 0.1702778 0.0124336 0.097792 0.0103474 -0.0284254 unknown
polarizability: 210.7342227|16.5085643|154.7638593|-0.9770953|-18.7748587|78.6977635 unknown
InChI: InChI=1S/C9H7Br3/c1-5(2)6-3-8(11)9(12)4-7(6)10/h3-4H,1H2,2H3
charge 0 multiplicity 1
19 atoms
Br -1.72476 -2.598402 0.320568
Br 2.843769 2.269086 -0.437072
Br 3.798693 -1.062228 0.093721
C  -0.844805 0.199582 -0.031989
C  -2.278605 0.651741 -0.048457
C  -0.421672 -1.140618 0.166879
C  0.174971 1.172942 -0.208439
C  1.545266 0.836879 -0.18167
C  0.941059 -1.498071 0.19893
C  1.932819 -0.505717 0.03031
C  -3.028651 0.614309 1.273111
C  -2.824921 1.139752 -1.194013
H  -0.121753 2.214108 -0.362142
H  1.236094 -2.540004 0.3432
H  -2.527234 1.258371 2.021189
H  -3.05991 -0.406126 1.695542
H  -4.065845 0.96868 1.148547
H  -3.858567 1.502876 -1.220025
H  -2.263851 1.16744 -2.134889
