program: Gaussian 09
title: 000093856
version: EM64L-G09RevD.01
frameworkgroup: C1[X(C10H18O3)]
method: RPBEPBE
basis: SDD
operation: Freq
keyword: #pfreq=noraman
keyword: PBEPBE/SDD
title: #p freq=noraman PBEPBE/SDD
converged: YES YES NO NO
title: Mulliken charges:
elementType: O O O C C C C C C C C C C H H H H H H H H H H H H H H H H H H
charge: -0.265599 -0.278551 -0.207289 0.049821 -0.425842 -0.449669 -0.397580 -0.397665 -0.385923 -0.345716 0.226950 -0.219095 -0.672389 0.171567 0.207547 0.204251 0.223174 0.208560 0.202897 0.191026 0.192446 0.205675 0.200462 0.192500 0.229735 0.209828 0.227703 0.230488 0.211910 0.230349 0.228428
chargesum: 0.00000
title: Mulliken charges with hydrogens summed into heavy atoms:
elementType: O O O C C C C C C C C C C
charge: -0.265599 -0.278551 -0.207289 0.221388 -0.014044 -0.017935 -0.003657 0.000455 0.007039 0.093848 0.226950 0.239097 -0.001702
polarizability: 1.52720587e+02 3.32845601e+00 1.10171458e+02 -8.43322253e-01 9.38579814e-01 8.94393629e+01
1716.lowfreq: -6.8125 -0.0010 -0.0009 -0.0008 7.1140 18.8067 22.4624 38.1119 52.5314
frequency: 22.1584 33.9305 52.4082 61.2838 93.8921 131.4439 150.5472 196.7514 199.2109 217.4333 249.8385 284.2932 318.7102 354.1624 410.3604 429.9237 443.5576 476.1000 541.6612 561.8939 693.0468 782.5092 787.9803 800.1152 816.7583 842.5063 878.3838 894.0261 908.8270 925.3252 928.9277 996.4762 1006.3825 1028.1988 1044.4390 1051.3006 1071.0612 1080.7956 1109.7994 1112.4445 1125.0790 1136.3604 1149.5093 1189.9693 1203.5907 1241.3759 1249.5677 1252.1346 1256.6501 1299.7791 1308.8903 1329.3834 1335.3172 1339.7703 1345.1839 1352.0143 1360.7968 1380.4039 1401.0599 1453.9775 1462.4076 1463.2976 1463.5363 1464.5773 1472.5224 1475.4472 1481.0066 1487.7627 1673.4405 2896.1715 2920.3345 2966.0055 2968.1872 2970.9914 2976.7267 2992.7418 2995.6849 2997.7722 3008.9477 3029.8190 3031.9842 3037.7205 3044.9331 3062.6905 3067.1270 3092.2886 3106.9612
redmass: 3.7816 4.2781 3.9901 2.5792 2.7179 2.6503 2.6021 3.8290 3.5346 1.9484 1.2636 4.8961 1.8894 3.3512 2.9456 3.2229 3.3257 2.0768 2.3788 3.6212 5.4205 1.9021 1.7416 1.0978 3.4861 2.0786 1.7014 1.9520 2.7866 2.0752 3.1621 1.9595 2.8422 2.5018 1.7768 1.1387 6.7332 1.3786 2.5921 2.4682 3.4036 1.4745 2.2611 1.3322 1.1960 1.3233 1.1359 1.2809 1.2989 1.1784 1.3197 1.3679 1.4721 1.4788 1.4821 1.3515 1.4328 1.5456 1.2719 1.0798 1.0851 1.0889 1.0409 1.0897 1.0837 1.0580 1.0967 1.0714 10.5873 1.0828 1.0631 1.0629 1.0645 1.0617 1.0610 1.0623 1.0359 1.0930 1.0583 1.0972 1.0965 1.1012 1.1027 1.1021 1.1066 1.0985 1.1025
irintensity: 0.2691 0.0941 1.4353 0.4233 0.9215 8.4003 3.8722 3.5560 1.7152 1.6619 1.0953 4.7916 1.6211 8.9668 1.1353 1.0429 0.5461 0.4108 0.8712 6.5227 8.3625 1.4071 3.2938 4.0718 4.6614 6.4730 4.7794 15.0342 6.9987 2.9133 11.1796 6.6587 3.9969 23.1168 29.4273 0.6412 420.9687 23.2821 51.2518 3.8405 213.8683 7.7326 1.9881 6.3946 10.7938 1.5562 0.0020 2.0499 3.0146 0.6693 0.0674 3.3821 2.4975 0.7802 6.7210 3.0066 8.0199 30.8911 19.0324 15.4890 0.7604 5.7307 13.0276 12.5032 21.3582 5.5626 4.0877 12.1959 176.0913 48.9730 41.0190 34.4681 41.7752 34.7266 22.0861 20.2104 20.3850 34.2524 20.7313 73.1675 68.2692 3.5837 85.5113 57.7559 9.4520 31.0998 46.0512
temp: 298.150 k
press: 1.00000 atm
elementType: 8 8 8 6 6 6 6 6 6 6 6 6 6 1 1 1 1 1 1 1 1 1 1 1 1 1 1 1 1 1 1
symmnumber: 1
zpe: 701674.2 jmol-1
zpe.correction: 0.267254 hartree
zpe.thermalcorrener: 0.281702 hartree
zpe.thermalcorrenthalpy: 0.282646 hartree
zpe.thermalcorrgfe: 0.223839 hartree
zpe.sumelectzpe: -616.468585 hartree
zpe.sumelectthermal: -616.454137 hartree
zpe.sumelectthermalent: -616.453193 hartree
zpe.sumelectthermalfe: -616.512000 hartree
dipole: 0.0246 2.8918 1.1280
dipole: 3.1042
quadrupole: -62.1200 -85.9716 -77.8209
quadrupole: 3.0593 0.2497 -1.2548
quadrupole: 13.1841 -10.6674 -2.5167 3.0593 0.2497 -1.2548
hfenergy: -616.7358388 hartree
pointgroup: C01 [X(C10H18O3)]
dipole: 0.0167971 1.1464968 0.4204457 debye
polarizability: 152.7974926|2.8599768|110.1369434|-0.1750398|0.5523499|89.396972 unknown
InChI: InChI=1S/C10H18O3/c1-2-12-10(11)8-13-9-6-4-3-5-7-9/h9H,2-8H2,1H3
charge 0 multiplicity 1
31 atoms
O  -0.275407 -0.523538 -0.267163
O  3.196667 0.436459 0.074837
O  2.276827 -1.70725 -0.07157
C  -1.592841 -0.071059 0.231762
C  -2.039896 1.26742 -0.397229
C  -2.578857 -1.202654 -0.096962
C  -3.472468 1.637112 0.065036
C  -4.014525 -0.839054 0.355012
C  -4.476719 0.505152 -0.257786
C  0.828204 0.309144 0.168304
C  2.13134 -0.475211 0.03095
C  4.568224 -0.157196 0.028516
C  5.55435 1.000152 0.147442
H  -1.528581 0.055431 1.340286
H  -2.016909 1.157481 -1.500013
H  -1.337432 2.081254 -0.130725
H  -2.233268 -2.135792 0.383724
H  -2.55743 -1.372537 -1.191435
H  -3.787499 2.583488 -0.414758
H  -3.469631 1.820789 1.159958
H  -4.046987 -0.765024 1.462043
H  -4.710494 -1.651248 0.071272
H  -5.483996 0.770655 0.117189
H  -4.560291 0.395281 -1.358592
H  0.917157 1.243952 -0.421098
H  0.720975 0.601005 1.2389
H  4.662876 -0.882776 0.857093
H  4.673961 -0.708449 -0.923312
H  6.589661 0.61411 0.118455
H  5.426824 1.714445 -0.683856
H  5.412665 1.543057 1.097616
