program: Gaussian 09
title: 000093886
version: EM64L-G09RevD.01
frameworkgroup: C1[X(C17H19F3N2O)]
method: RPBEPBE
basis: SDD
operation: Freq
keyword: #p
keyword: freq=noraman
keyword: PBEPBE/SDD
title: #p freq=noraman PBEPBE/SDD
converged: YES YES NO NO
title: Mulliken charges:
elementType: F F F O N N C C C C C C C C C C C C C C C C C H H H H H H H H H H H H H H H H H H H
charge: -0.164337 -0.151494 -0.164113 -0.278544 -0.187977 -0.223659 0.162934 -0.075618 0.278064 0.336632 -0.736010 -0.745052 -0.753709 -0.611831 -0.559728 0.270262 -0.658422 0.270906 0.223515 -0.438706 0.130317 0.222929 -0.664827 0.222459 0.219143 0.234113 0.227467 0.226150 0.212030 0.223244 0.217325 0.240034 0.228039 0.262547 0.261547 0.241530 0.234641 0.223688 0.279709 0.234115 0.235602 0.295085
chargesum: 0.00000
title: Mulliken charges with hydrogens summed into heavy atoms:
elementType: F F F O N N C C C C C C C C C C C C C C C C C
charge: -0.164337 -0.151494 -0.164113 -0.278544 -0.187977 -0.223659 0.162934 0.146841 0.278064 0.336632 -0.055287 -0.083629 -0.068311 -0.349284 -0.298180 0.270262 0.041438 0.270906 0.223515 -0.158997 0.130317 0.222929 0.099975
polarizability: 3.42016296e+02 -2.07961159e+01 2.17478563e+02 -3.67064977e+00 -3.95225760e-01 1.20509332e+02
1716.lowfreq: -7.3771 -5.3167 -0.0009 -0.0006 -0.0004 2.0436 36.1883 44.9881 57.1097
frequency: 36.1607 44.9735 57.0933 76.1437 79.2176 99.0535 118.3865 131.1264 155.6118 176.3532 194.3771 205.4564 220.4533 229.5917 239.2169 240.4395 259.0709 270.1230 284.0583 288.8065 290.8271 316.2108 321.3875 332.1754 349.4282 372.6855 391.1162 427.1036 458.0885 466.5883 477.4144 485.5704 513.7031 535.4764 568.6225 589.2784 600.2178 627.3218 652.1426 680.1176 681.4440 706.3433 715.6018 727.5094 749.4093 791.2674 829.1993 838.0188 871.2736 877.2753 894.5416 905.9771 929.5989 942.3548 976.5722 992.1140 1007.2846 1028.4862 1041.0254 1063.1576 1082.2982 1101.4932 1112.1981 1123.2868 1136.1912 1148.9443 1164.7837 1165.7286 1190.5525 1222.2788 1229.5713 1251.9239 1260.5029 1281.3583 1297.4871 1308.5764 1336.7445 1349.6786 1376.9376 1381.3378 1384.8274 1397.8216 1405.5972 1432.0945 1454.7639 1459.4308 1464.1650 1467.6547 1472.1738 1475.1051 1477.2991 1481.3146 1483.5058 1488.9725 1492.8704 1498.7752 1512.7401 1560.1056 1577.0603 1628.6201 1652.5267 2890.4991 2928.4790 2976.5225 2981.2742 2985.4147 2989.2395 3043.7067 3068.1546 3072.2211 3074.2424 3079.9456 3080.3789 3085.3353 3096.7195 3098.2853 3116.2395 3164.7533 3188.5389 3201.7326
redmass: 4.1865 10.6850 4.7461 3.4006 4.0250 4.8772 1.2796 4.9954 3.1006 3.6812 3.1940 1.1263 2.7400 3.0416 1.3628 1.3128 2.9996 2.7987 1.8092 2.9773 1.9787 2.9411 4.0400 4.3227 2.9693 5.9661 4.0577 5.4734 3.4866 10.9341 7.3549 4.7610 4.4627 4.3372 4.6153 4.3199 4.4840 6.0993 7.2360 5.0378 5.7335 5.7317 3.8856 6.5806 2.6623 3.0161 1.8905 3.4175 1.5162 3.2995 1.5678 2.9988 1.7347 1.6391 8.0433 1.4022 2.4570 4.0744 1.7784 1.7269 3.4604 2.3680 1.3815 1.3171 2.4189 3.4656 3.1370 2.8275 3.0355 2.7217 2.4993 1.9724 2.6622 2.2221 1.8935 2.2817 1.7357 1.9937 1.1999 3.4631 1.3547 1.2294 1.5463 1.3006 2.0119 1.0545 1.1060 2.1484 1.0752 1.0806 1.1597 1.1410 1.2034 1.0617 1.1272 1.0454 3.7646 8.6307 7.5987 7.9092 7.4709 1.0829 1.0501 1.0356 1.0351 1.0344 1.0363 1.0836 1.0989 1.1022 1.0990 1.0991 1.1003 1.0998 1.0998 1.0983 1.0989 1.0917 1.0902 1.0925
irintensity: 0.1672 0.0382 0.8663 0.7470 0.8405 0.8542 0.5047 10.2009 2.9633 0.9603 4.6722 0.2055 0.5118 1.5151 0.8211 1.1000 0.4211 2.3863 0.6236 2.4400 0.2685 0.4989 8.2345 3.0386 3.0277 1.6388 7.0688 0.9874 5.8066 7.9200 0.5130 6.3833 0.3442 1.6905 38.0817 5.1996 18.3790 1.2301 3.7609 0.4771 0.3221 1.9497 2.2041 0.8252 0.3615 6.7706 40.2590 32.2330 56.7844 20.5573 2.9718 22.0721 7.0232 11.6485 205.6878 4.3275 24.8207 105.9387 98.0764 40.4980 11.1387 28.6275 23.3131 0.2400 52.2341 49.0266 61.4242 36.5563 39.7302 60.2250 55.7440 92.2945 21.6386 29.6321 0.9532 55.5480 27.2053 13.9782 19.5591 41.3827 67.0083 15.5638 28.5081 35.1028 88.4961 7.4203 2.7586 23.3428 38.5504 30.0350 68.9228 21.9909 28.8353 10.8921 34.7454 19.9430 208.1574 54.4895 91.7525 711.3472 69.2401 67.7424 114.8072 28.4102 29.8740 31.1935 36.8948 28.4722 17.5238 23.6887 26.1698 51.9147 18.0438 29.7441 20.8946 25.5354 1.6607 2.5819 5.8040 7.5338
temp: 298.150 k
press: 1.00000 atm
elementType: 9 9 9 8 7 7 6 6 6 6 6 6 6 6 6 6 6 6 6 6 6 6 6 1 1 1 1 1 1 1 1 1 1 1 1 1 1 1 1 1 1 1
symmnumber: 1
zpe: 863348.7 jmol-1
zpe.correction: 0.328832 hartree
zpe.thermalcorrener: 0.350997 hartree
zpe.thermalcorrenthalpy: 0.351941 hartree
zpe.thermalcorrgfe: 0.278758 hartree
zpe.sumelectzpe: -1141.805083 hartree
zpe.sumelectthermal: -1141.782918 hartree
zpe.sumelectthermalent: -1141.781974 hartree
zpe.sumelectthermalfe: -1141.855158 hartree
dipole: 9.3205 1.9954 -0.4352
dipole: 9.5416
quadrupole: -141.5473 -132.7742 -137.6528
quadrupole: 8.4538 -1.7656 -0.8724
quadrupole: -4.2226 4.5506 -0.3280 8.4538 -1.7656 -0.8724
hfenergy: -1142.1339152 hartree
pointgroup: C01 [X(C17H19F3N2O1)]
dipole: 3.6531497 -0.8450805 0.1803565 debye
polarizability: 342.5524164|18.7669318|216.8394357|5.7798062|1.836393|120.6123385 unknown
InChI: InChI=1S/C17H19F3N2O/c1-9-16(2,3)12-6-10-11(17(18,19)20)7-15(23)22(5)13(10)8-14(12)21(9)4/h6-9H,1-5H3
charge 0 multiplicity 1
42 atoms
F  -2.013809 2.849706 -1.021496
F  -3.958674 2.446257 0.059388
F  -2.05579 2.749793 1.24404
O  -4.181269 -2.48163 -0.144471
N  3.03228 -1.213151 0.027936
N  -1.852426 -2.116476 -0.096398
C  2.850632 1.197654 0.035005
C  3.799348 0.004933 0.456969
C  1.482644 0.505776 0.069597
C  1.672288 -0.913901 0.017241
C  3.122939 1.676475 -1.420651
C  2.976891 2.384112 1.015833
C  5.231651 0.048287 -0.091493
C  0.203883 1.035819 0.065496
C  0.57821 -1.798062 -0.035002
C  -0.943398 0.173769 0.013203
C  3.543247 -2.564656 0.245039
C  -0.73911 -1.256658 -0.043936
C  -2.307206 0.652402 0.012659
C  -3.383897 -0.212629 -0.041138
C  -3.211989 -1.65665 -0.096931
C  -2.584895 2.133958 0.071571
C  -1.657244 -3.578547 -0.156253
H  3.849656 0.004323 1.572744
H  4.113487 2.159353 -1.506373
H  3.07784 0.834533 -2.134368
H  2.35705 2.414579 -1.718656
H  2.730888 2.080457 2.049232
H  4.005489 2.79179 1.007599
H  2.294368 3.205469 0.731666
H  5.859539 -0.746254 0.350517
H  5.24957 -0.063405 -1.188916
H  5.702926 1.013321 0.168023
H  0.059967 2.119011 0.105051
H  0.733518 -2.877458 -0.053551
H  4.611992 -2.610116 -0.018887
H  3.011625 -3.278613 -0.408337
H  3.426536 -2.902588 1.298571
H  -4.415338 0.143146 -0.044187
H  -1.12711 -3.940291 0.743051
H  -1.085149 -3.860153 -1.05835
H  -2.657958 -4.034287 -0.198638
