program: Gaussian 09
title: 000093883
version: EM64L-G09RevD.01
frameworkgroup: C1[X(C24H20N2O4)]
method: RPBEPBE
basis: SDD
operation: Freq
keyword: #p
keyword: freq=noraman
keyword: PBEPBE/SDD
title: #p freq=noraman PBEPBE/SDD
converged: YES YES NO NO
title: Mulliken charges:
elementType: O O O O N N C C C C C C C C C C C C C C C C C C C C C C C C H H H H H H H H H H H H H H H H H H H H
charge: -0.344005 -0.343925 -0.327299 -0.327299 -0.339111 -0.339121 0.403649 0.403649 0.445790 0.445778 0.113802 0.113807 -0.568814 -0.568811 0.280891 0.280824 -0.594116 -0.594125 -0.416889 -0.416887 -0.423828 -0.423833 0.157204 0.157252 -0.244940 -0.244943 -0.238974 -0.238976 -0.522474 -0.522483 0.286490 0.286495 0.248229 0.248233 0.248096 0.248094 0.238879 0.238876 0.230422 0.230421 0.228433 0.228432 0.419479 0.419424 0.263309 0.227889 0.227910 0.227900 0.227897 0.263298
chargesum: 0.00000
title: Mulliken charges with hydrogens summed into heavy atoms:
elementType: O O O O N N C C C C C C C C C C C C C C C C C C C C C C C C
charge: -0.344005 -0.343925 -0.327299 -0.327299 0.080368 0.080302 0.403649 0.403649 0.445790 0.445778 0.113802 0.113807 -0.282323 -0.282316 0.280891 0.280824 -0.345886 -0.345893 -0.168793 -0.168793 -0.184949 -0.184957 0.157204 0.157252 -0.014517 -0.014521 -0.010541 -0.010543 0.196633 0.196612
polarizability: 6.44184485e+02 -5.89122372e+01 3.13095482e+02 6.45607570e-02 2.91588139e-02 1.18305923e+02
1716.lowfreq: -0.0011 -0.0006 0.0014 2.8893 6.7822 11.5776 15.9536 29.9617 30.9557
frequency: 15.9536 29.9617 30.9556 41.2175 77.6246 80.3663 87.9175 98.2502 106.4699 107.9787 135.3004 138.0196 140.4068 185.8213 195.7869 214.9825 217.0056 225.0061 233.1793 264.5025 298.6648 300.0258 321.0507 331.2111 339.3914 342.9744 357.8167 360.3890 408.2905 423.8559 437.2072 458.5962 461.1581 481.1282 481.1726 545.2172 546.6368 565.1282 580.7520 602.3799 605.2582 623.5670 625.0124 639.6505 646.1906 694.1805 694.5608 740.4970 741.7163 754.2115 759.2035 759.3176 778.9918 780.0071 780.2156 793.3969 812.6618 815.7888 847.2505 847.4138 882.7464 892.4352 892.4574 901.1324 929.8164 950.0854 950.2514 975.5596 975.5884 975.7764 984.9611 992.1810 992.1907 1022.9353 1023.1033 1060.4612 1063.7407 1117.1140 1117.1395 1125.3301 1137.0152 1154.7437 1161.3294 1167.5023 1170.9990 1173.6333 1179.2153 1184.4325 1213.9754 1218.8015 1244.6674 1254.8225 1259.7440 1265.3599 1278.0117 1278.3921 1325.5109 1329.7768 1404.6884 1405.3508 1413.1615 1426.2870 1426.2953 1427.9370 1437.0458 1447.9041 1450.7722 1461.1733 1464.5870 1469.3314 1469.3781 1474.5405 1476.6641 1501.6334 1503.7460 1525.3057 1530.8649 1569.5929 1579.2336 1588.0312 1604.8139 1606.1248 1641.0070 1641.8449 2973.7013 2973.8161 3068.0525 3068.1135 3120.7021 3120.7071 3129.0368 3129.0406 3135.5694 3135.5809 3142.6349 3142.6573 3144.3183 3144.3222 3152.8435 3152.8718 3163.5137 3163.5867 3370.9006 3372.8184
redmass: 6.0462 5.9978 4.6794 8.3252 3.3780 3.3103 5.5504 5.9868 6.8348 7.0242 4.5038 4.6905 6.3362 3.8160 3.6843 6.1062 2.6384 1.3112 1.5392 2.8900 8.6067 3.7044 4.2729 5.6449 5.1908 4.9763 6.1210 7.0080 6.1957 3.7862 4.1703 6.1565 6.2382 2.5868 2.5837 3.8562 3.8282 6.8487 6.7742 5.3541 5.3867 6.4038 6.2007 5.6683 5.6398 6.3277 6.3249 5.4225 4.8677 6.5370 1.2828 1.2860 5.0519 2.3325 2.3628 1.1432 1.0878 4.4457 1.3923 1.3924 5.6325 1.7327 1.7324 5.7284 5.4760 1.4247 1.4249 1.4590 1.4610 7.2542 6.3050 1.3557 1.3559 2.2807 2.2629 4.3691 4.0918 1.2540 1.2539 2.0800 1.6081 1.6677 1.3746 1.8017 1.2133 1.1927 1.5335 1.8247 1.6472 1.6440 1.6305 1.9058 2.9527 3.8400 1.8016 1.7548 2.0558 2.1892 5.3756 5.4802 2.0729 1.5629 2.4127 3.4791 2.3946 2.1164 2.4531 2.5596 1.8322 1.0507 1.0507 1.1567 1.3294 4.1683 3.3991 2.4141 8.0065 8.1983 7.5757 8.9571 6.0688 5.9591 6.9945 6.7526 1.0319 1.0319 1.1047 1.1047 1.0863 1.0863 1.0884 1.0884 1.1010 1.1010 1.0919 1.0919 1.0946 1.0946 1.0905 1.0905 1.1004 1.1004 1.0867 1.0787
irintensity: 0.0468 2.3897 4.7773 0.0000 3.0297 0.0001 0.0000 0.0002 0.4549 9.5594 0.0001 5.7617 0.0001 13.1198 0.0000 20.5172 0.0170 0.0272 0.0000 2.1340 0.0000 0.0000 3.2581 3.7517 0.0000 0.0001 3.3711 0.0001 107.2687 0.3220 0.0007 0.0008 30.9454 0.2380 43.6829 0.0009 0.0001 0.0000 3.9431 0.0001 1.9565 0.0000 29.9592 2.5711 0.0010 23.9275 0.0005 0.0021 0.0002 0.4936 0.0059 102.3825 0.0000 0.0001 9.2540 0.0005 209.8046 12.4056 0.0828 69.7975 0.0003 0.4260 53.2358 2.7761 0.0001 4.6850 0.0000 40.3637 0.0552 59.6688 0.0004 1.1895 0.0003 11.0774 0.0000 85.5832 0.0000 0.0162 0.1448 0.0000 6.8204 0.0000 1.5578 0.0000 39.9370 0.0000 104.2602 0.0002 84.0613 0.0002 38.5809 0.0002 133.6529 0.0000 21.2019 0.0049 11.7548 0.0000 23.6817 0.0046 534.1097 0.9753 50.4896 0.0001 426.9613 0.0008 210.3106 0.0007 107.9279 0.0653 31.3749 0.0033 150.8875 40.7010 0.0000 0.0000 403.6214 0.0000 23.2942 0.0001 123.0668 0.0022 147.0554 0.0082 99.1371 0.0103 0.0508 73.4299 7.6113 0.2093 0.1495 0.0036 0.8943 17.6689 5.4794 3.8746 0.9707 46.2674 12.8542 8.6414 93.1068 0.1700 0.0061 369.2418
temp: 298.150 k
press: 1.00000 atm
elementType: 8 8 8 8 7 7 6 6 6 6 6 6 6 6 6 6 6 6 6 6 6 6 6 6 6 6 6 6 6 6 1 1 1 1 1 1 1 1 1 1 1 1 1 1 1 1 1 1 1 1
symmnumber: 1
zpe: 1014336.9 jmol-1
zpe.correction: 0.386341 hartree
zpe.thermalcorrener: 0.411951 hartree
zpe.thermalcorrenthalpy: 0.412895 hartree
zpe.thermalcorrgfe: 0.329594 hartree
zpe.sumelectzpe: -1334.878709 hartree
zpe.sumelectthermal: -1334.853099 hartree
zpe.sumelectthermalent: -1334.852155 hartree
zpe.sumelectthermalfe: -1334.935456 hartree
dipole: 0.0001 -0.0007 0.0069
dipole: 0.0069
quadrupole: -128.1155 -145.6358 -182.7166
quadrupole: 21.7378 0.0152 -0.0019
quadrupole: 24.0404 6.5202 -30.5606 21.7378 0.0152 -0.0019
hfenergy: -1335.2650497 hartree
pointgroup: C01 [X(C24H20N2O4)]
dipole: -0.0000509 -0.0002915 -0.0026961 debye
polarizability: 644.8310918|57.0626911|312.4488874|-0.0288126|-0.0172001|118.3059111 unknown
InChI: InChI=1S/C24H20N2O4/c1-29-21-13-17-9-5-3-7-15(17)11-19(21)23(27)25-26-24(28)20-12-16-8-4-6-10-18(16)14-22(20)30-2/h3-14,25-26H,1-2H3
charge 0 multiplicity 1
50 atoms
O  2.417317 -2.124128 -0.091219
O  -2.416519 2.124304 -0.087643
O  1.389102 1.979121 -0.093859
O  -1.387689 -1.979095 -0.090915
N  0.660187 -0.212336 -0.092698
N  -0.658861 0.212358 -0.091855
C  5.475298 0.835924 -0.09186
C  -5.47388 -0.836406 -0.089354
C  5.84667 -0.563405 -0.091882
C  -5.845489 0.562854 -0.089913
C  3.076474 0.208922 -0.092837
C  -3.075143 -0.208973 -0.089237
C  4.088805 1.17561 -0.092542
C  -4.087319 -1.175841 -0.089213
C  3.466757 -1.1869 -0.092194
C  -3.465692 1.186783 -0.089119
C  4.814017 -1.555824 -0.092046
C  -4.813022 1.555464 -0.089744
C  6.504507 1.834403 -0.091523
C  -6.502914 -1.83506 -0.089305
C  7.237526 -0.910647 -0.091674
C  -7.236413 0.909852 -0.090512
C  1.666583 0.72797 -0.094569
C  -1.665228 -0.727976 -0.090161
C  7.852441 1.468363 -0.091232
C  -7.850915 -1.469261 -0.089831
C  8.219329 0.084219 -0.091291
C  -8.218046 -0.085182 -0.090431
C  2.731726 -3.554965 -0.094329
C  -2.731342 3.555052 -0.090858
H  3.770875 2.22455 -0.093073
H  -3.769208 -2.224723 -0.089266
H  5.105086 -2.610813 -0.091384
H  -5.104297 2.610393 -0.089414
H  6.214902 2.891735 -0.091478
H  -6.213129 -2.892342 -0.088813
H  7.523967 -1.96922 -0.091719
H  -7.523038 1.968375 -0.090942
H  8.633822 2.235691 -0.091056
H  -8.632159 -2.23673 -0.089867
H  9.279487 -0.192556 -0.091009
H  -9.278252 0.191411 -0.090775
H  0.833745 -1.230177 -0.091527
H  -0.832415 1.230209 -0.09283
H  1.754481 -4.05843 -0.095615
H  3.301342 -3.83369 0.811902
H  3.301881 -3.82975 -1.001421
H  -3.301522 3.833586 0.815078
H  -3.301097 3.829686 -0.998244
H  -1.754239 4.058793 -0.091599
