program: Gaussian 09
title: 000093827
version: EM64L-G09RevD.01
frameworkgroup: C1[X(C10H20N2)]
method: RPBEPBE
basis: SDD
operation: Freq
keyword: #pfreq=noraman
keyword: PBEPBE/SDD
title: #p freq=noraman PBEPBE/SDD
converged: NO YES NO NO
title: Mulliken charges:
elementType: N N C C C C C C C C C C H H H H H H H H H H H H H H H H H H H H
charge: -0.219675 0.069328 0.389518 0.369990 -0.498973 -0.457850 -0.442527 -0.746739 -0.756244 -0.728533 -0.725951 -0.585971 0.221043 0.207661 0.214720 0.202524 0.212407 0.213446 0.238621 0.230051 0.210045 0.220724 0.217858 0.241328 0.221820 0.233844 0.204053 0.221106 0.244483 0.191633 0.205447 0.180813
chargesum: 0.00000
title: Mulliken charges with hydrogens summed into heavy atoms:
elementType: N N C C C C C C C C C C
charge: -0.219675 0.069328 0.389518 0.369990 -0.070269 -0.040606 -0.016675 -0.068022 -0.076334 -0.068815 -0.068730 -0.199711
polarizability: 1.36432603e+02 1.03455214e+01 1.29998901e+02 -1.70654095e+00 -1.85124054e+00 9.91219866e+01
1716.lowfreq: -18.9726 -7.0828 -0.0010 -0.0007 0.0003 11.7013 53.1759 111.1807 117.3042
frequency: 53.0603 111.1626 117.2605 150.6465 171.7869 203.0021 224.5955 241.3541 248.7641 268.6734 281.6529 293.4477 336.4299 350.8705 369.7262 390.3914 401.5675 440.6043 470.1344 485.8011 550.1747 575.9379 666.8005 733.3174 736.3025 800.6118 822.1002 867.7541 872.0395 899.6406 918.3924 923.0097 958.3618 976.4052 983.7379 999.6739 1017.7871 1043.8971 1089.7241 1112.5377 1130.5528 1134.9300 1158.5255 1175.0233 1192.6295 1226.4987 1241.6110 1254.4196 1266.0569 1285.8747 1330.4799 1341.4869 1352.5446 1368.2457 1378.9417 1391.0476 1393.8066 1447.4348 1458.2080 1461.1958 1462.6535 1463.8115 1468.1746 1472.9417 1481.5139 1484.4589 1486.2900 1493.3295 1496.9797 1571.4924 2978.5818 2980.3543 2980.7375 2984.6776 2988.8252 2990.4446 2999.6685 3023.4047 3040.5274 3057.0241 3060.9068 3073.0832 3074.7083 3080.7768 3082.4820 3086.5422 3091.2876 3104.1006 3120.1077 3168.5361
redmass: 2.8729 2.5454 1.2788 1.7368 2.1981 1.1439 1.3353 1.8753 1.1479 2.2324 2.3990 2.3072 2.5830 2.3361 2.6767 2.5490 2.7551 3.0545 3.1667 3.2392 2.9887 3.1027 3.0281 1.3897 1.3868 2.2742 2.0611 1.3539 2.2832 1.8939 1.6417 1.4843 1.6847 1.5437 1.6308 1.3535 1.8311 1.8550 2.3725 1.8196 2.1260 2.0851 1.8413 2.7315 2.8837 2.0864 1.5382 2.4559 2.2938 1.3389 1.3675 1.4127 1.4692 1.2191 1.1852 1.2020 1.2039 1.0578 1.0780 1.0612 1.1212 1.0687 1.0833 1.0627 1.0719 1.0643 1.0571 1.0799 1.1192 4.4582 1.0417 1.0481 1.0391 1.0552 1.0417 1.0414 1.0621 1.1008 1.1014 1.1022 1.0592 1.0980 1.0987 1.0961 1.0977 1.0991 1.0999 1.0993 1.0983 1.1130
irintensity: 0.4948 0.2151 1.3661 0.4112 0.2167 0.0831 1.1974 2.3986 0.1471 0.9512 1.2445 0.2145 0.8358 0.8986 0.4873 1.3668 2.1317 1.4506 0.9492 6.1752 10.6228 3.4912 2.4067 0.2893 2.3119 0.1891 6.2290 77.5386 0.4405 0.3936 2.6373 0.5725 6.5235 5.0487 11.5506 2.0143 4.4371 1.9931 13.0938 7.1452 20.8368 57.2665 3.7604 19.4477 15.0600 6.7523 20.0306 35.5098 43.0600 4.3922 1.2639 3.0285 4.4789 19.9412 32.0006 29.7111 14.2773 1.6274 4.6988 1.7359 9.3830 11.3487 2.7390 5.6571 5.6101 15.8272 19.1963 6.2698 5.9777 104.8184 26.0650 19.9920 13.1208 14.2115 34.6041 66.1802 46.9519 10.0703 20.0545 62.0429 50.8589 18.6472 21.7955 26.5616 65.7958 28.2911 26.6282 31.2183 23.2733 36.0572
temp: 298.150 k
press: 1.00000 atm
elementType: 7 7 6 6 6 6 6 6 6 6 6 6 1 1 1 1 1 1 1 1 1 1 1 1 1 1 1 1 1 1 1 1
symmnumber: 1
zpe: 747648.5 jmol-1
zpe.correction: 0.284764 hartree
zpe.thermalcorrener: 0.298632 hartree
zpe.thermalcorrenthalpy: 0.299576 hartree
zpe.thermalcorrgfe: 0.246277 hartree
zpe.sumelectzpe: -501.525727 hartree
zpe.sumelectthermal: -501.511859 hartree
zpe.sumelectthermalent: -501.510915 hartree
zpe.sumelectthermalfe: -501.564213 hartree
dipole: -0.2316 -2.4864 0.0008
dipole: 2.4972
quadrupole: -72.8479 -78.7279 -77.0153
quadrupole: -0.7905 -0.1723 -0.0340
quadrupole: 3.3491 -2.5309 -0.8182 -0.7905 -0.1723 -0.0340
hfenergy: -501.8104908 hartree
pointgroup: C01 [X(C10H20N2)]
dipole: -0.0714382 -0.9797776 -0.0136802 debye
polarizability: 132.6637134|-10.6528569|133.4379708|-3.2717008|3.2470411|99.4518064 unknown
InChI: InChI=1S/C10H20N2/c1-9(2)7-6-8-10(3,4)12(9)11-5/h5-8H2,1-4H3
charge 0 multiplicity 1
32 atoms
N  -0.080043 0.579358 0.053553
N  -0.353445 1.909861 0.158584
C  -1.11581 -0.53158 0.082827
C  1.405064 0.274997 -0.031205
C  -0.457224 -1.854033 -0.41159
C  1.676816 -1.031026 0.765422
C  0.857667 -2.26024 0.295595
C  -1.666223 -0.710207 1.526904
C  -2.278842 -0.2412 -0.919223
C  1.859606 0.165705 -1.514981
C  2.218785 1.409815 0.640406
C  -1.531583 2.463505 0.356418
H  -0.286407 -1.756797 -1.500079
H  -1.212127 -2.654515 -0.290287
H  1.455335 -0.815779 1.828788
H  2.759601 -1.251344 0.709437
H  0.640861 -2.905219 1.167815
H  1.454855 -2.878168 -0.40104
H  -2.014662 0.250817 1.94374
H  -0.88922 -1.109345 2.201938
H  -2.519026 -1.414933 1.526119
H  -2.711879 -1.202323 -1.252389
H  -3.099979 0.348461 -0.482658
H  -1.90262 0.294232 -1.808344
H  1.404273 -0.692279 -2.037247
H  1.576719 1.087922 -2.052907
H  2.959058 0.055077 -1.571703
H  1.860346 1.59973 1.666962
H  2.1372 2.351801 0.078334
H  3.282278 1.106749 0.684851
H  -1.52892 3.557759 0.411251
H  -2.497754 1.956301 0.474809
