program: Gaussian 09
title: 000093791
version: EM64L-G09RevD.01
frameworkgroup: C1[X(C7H5NO2)]
method: RPBEPBE
basis: SDD
operation: Freq
keyword: #pfreq=noraman
keyword: PBEPBE/SDD
title: #p freq=noraman PBEPBE/SDD
converged: YES YES NO YES
title: Mulliken charges:
elementType: O O N C C C C C C C H H H H H
charge: -0.403718 -0.406767 -0.023445 0.145202 0.169505 0.208512 -0.370725 -0.415808 -0.149104 -0.234226 0.263832 0.230800 0.235776 0.381792 0.368373
chargesum: 0.00000
title: Mulliken charges with hydrogens summed into heavy atoms:
elementType: O O N C C C C C C C
charge: -0.021926 -0.038395 -0.023445 0.145202 0.169505 0.208512 -0.106893 -0.185007 0.086672 -0.234226
polarizability: 1.25443102e+02 8.29450563e-01 9.89226195e+01 9.89077894e-04 1.11654846e-03 3.50109794e+01
1716.lowfreq: -13.8551 -3.1936 0.0006 0.0008 0.0010 10.1040 105.8063 127.9305 225.3972
frequency: 105.8057 127.9298 225.3972 227.2187 296.2270 382.9587 421.2187 430.4556 450.7378 461.1037 503.0526 563.8805 591.4573 594.3219 638.4745 726.2645 785.7375 787.5067 858.1619 964.3810 980.7881 1053.2129 1147.4096 1161.9173 1178.3387 1217.1772 1270.3850 1317.1940 1394.8155 1454.3275 1487.5262 1590.3167 1626.9211 2165.4160 3135.3314 3159.4237 3190.2445 3512.2527 3585.6872
redmass: 7.7101 10.2134 4.2578 6.8074 6.0420 1.1174 6.0462 5.3847 9.3697 1.0924 6.3047 4.7098 5.9789 4.5023 7.2336 1.9458 2.3546 6.4324 1.4280 1.3221 4.3751 2.2265 1.4013 1.3445 1.4306 2.3538 2.0179 2.6337 5.1541 3.3114 3.0647 6.2920 7.0125 12.6110 1.0886 1.0936 1.0966 1.0658 1.0662
irintensity: 0.3276 3.5800 1.8368 1.5256 14.6044 125.6924 2.3313 0.0400 3.6266 185.0761 2.6061 1.2111 3.1728 0.1604 9.2282 41.6554 55.1319 2.5398 1.4021 1.3729 137.7726 38.6242 159.3605 67.4547 13.4669 94.2285 16.9296 7.5118 5.3475 142.6531 3.2891 110.6287 91.4912 49.7260 7.1179 10.8236 2.7551 48.3211 53.8653
temp: 298.150 k
press: 1.00000 atm
elementType: 8 8 7 6 6 6 6 6 6 6 1 1 1 1 1
symmnumber: 1
zpe: 273771.2 jmol-1
zpe.correction: 0.104274 hartree
zpe.thermalcorrener: 0.112828 hartree
zpe.thermalcorrenthalpy: 0.113773 hartree
zpe.thermalcorrgfe: 0.071061 hartree
zpe.sumelectzpe: -474.219745 hartree
zpe.sumelectthermal: -474.211191 hartree
zpe.sumelectthermalent: -474.210247 hartree
zpe.sumelectthermalfe: -474.252958 hartree
dipole: -4.8929 1.1264 -0.0003
dipole: 5.0209
quadrupole: -60.4295 -50.7663 -60.0590
quadrupole: -8.5823 -0.0017 -0.0001
quadrupole: -3.3445 6.3186 -2.9741 -8.5823 -0.0017 -0.0001
hfenergy: -474.3240191 hartree
pointgroup: C01 [X(C7H5N1O2)]
dipole: -1.8385195 0.7224324 -0.0001295 debye
dipolederiv: -0.4260188 0.6057917 0.0000161 0.4260883 -1.0339785 -0.0000469 0.0000141 -0.0000511 -0.4024989 -0.2723586 -0.5729433 0.0000108 -0.3652931 -1.1540655 -0.0000018 0.0000129 -0.000019 -0.3964677 -0.4913188 0.0191951 0.0001445 0.0671388 -0.2422436 0.0000077 0.0000102 0.000013 -0.2488466 -0.3785653 0.0008076 -0.0000033 0.0302945 -0.3388996 -0.0000031 0.0000296 0.0000095 0.01285 0.6570459 -0.6362744 -0.0000401 -0.1771464 0.9925937 0.0000447 0.0000055 0.000037 0.109146 0.5607628 0.5894649 -0.0000094 0.0827664 1.1259159 0.0000083 0.0000105 0.0000038 0.1250855 -0.363488 0.4551072 0.0000152 0.106787 -0.2243745 -0.0000061 0.0000039 -0.000023 -0.2163016 -0.3755786 -0.4828255 -0.0000087 -0.0894029 -0.2969219 0.0000068 -0.00001 0.0000296 -0.248142 0.1592831 0.0015888 -0.0000119 -0.0185408 0.4946758 0.000013 -0.0000073 0.0000108 -0.0901526 0.5908944 -0.0232287 -0.0001291 -0.0761479 -0.0563113 -0.0000273 -0.0000801 -0.0000277 0.0475198 0.0627931 -0.0431848 0.0000032 -0.0590676 -0.0083263 -0.0000018 -0.0000021 0.0000027 0.1883825 0.0492181 0.0448949 0.0000062 0.0768933 -0.0835307 -0.0000095 0.000005 -0.000018 0.1900913 -0.0953335 -0.0067711 0.0000109 -0.0014017 0.0981086 -0.0000004 0.0000149 -0.0000005 0.1541812 0.1802889 -0.1168822 0.0000036 -0.0994203 0.3714226 0.000016 -0.0000042 0.000017 0.3851675 0.1423754 0.1652599 -0.0000077 0.0964522 0.3559353 0.0000004 -0.0000029 0.0000157 0.3899855 unknown
polarizability: 125.1075778|-3.0779348|99.258144|0.001143|0.0009583|35.0109794 unknown
InChI: InChI=1S/C7H5NO2/c8-4-5-6(9)2-1-3-7(5)10/h1-3,9-10H
charge 0 multiplicity 1
15 atoms
O  0.411107 -2.427019 -0.000124
O  0.44759 2.430739 -0.000012
N  3.072025 -0.069309 0.000186
C  0.447065 0.039376 -0.000077
C  -0.256382 -1.206975 -0.000067
C  -0.300239 1.252842 -0.000006
C  -1.667885 -1.237461 0.00001
C  -1.710984 1.226354 0.000054
C  -2.378268 -0.021323 0.000065
C  1.877615 0.024538 -0.000162
H  -2.176482 -2.204123 0.000014
H  -2.283469 2.16098 0.000106
H  -3.472858 -0.041818 0.000117
H  1.398021 -2.308427 -0.000166
H  -0.136857 3.229027 -0.00004
