program: Gaussian 09
title: 000093818
version: EM64L-G09RevD.01
frameworkgroup: C1[X(C19H20N2O4)]
method: RPBEPBE
basis: SDD
operation: Freq
keyword: #p
keyword: freq=noraman
keyword: PBEPBE/SDD
title: #p freq=noraman PBEPBE/SDD
converged: YES YES NO NO
title: Mulliken charges:
elementType: O O O O N N C C C C C C C C C C C C C C C C C C C H H H H H H H H H H H H H H H H H H H H
charge: -0.292928 -0.290019 -0.259381 -0.265015 -0.390752 -0.120187 0.440719 0.239320 -0.430177 -0.317045 -0.323682 -0.362681 0.221487 0.275307 -0.320437 -0.349278 -0.360498 -0.346819 0.180607 -0.222941 0.182884 -0.219518 -0.220186 -0.675568 -0.675192 0.220333 0.320959 0.271045 0.270396 0.313211 0.270224 0.268080 0.251497 0.239552 0.222241 0.228965 0.229318 0.228506 0.227624 0.228655 0.228725 0.212672 0.228952 0.229808 0.211215
chargesum: 0.00000
title: Mulliken charges with hydrogens summed into heavy atoms:
elementType: O O O O N N C C C C C C C C C C C C C C C C C C C
charge: -0.292928 -0.290019 -0.259381 -0.265015 -0.077540 -0.120187 0.440719 0.239320 -0.209844 0.003915 -0.052637 -0.092285 0.221487 0.275307 -0.050213 -0.081199 -0.109001 -0.107268 0.180607 -0.000699 0.182884 0.238765 0.235944 -0.005516 -0.005216
polarizability: 5.36132714e+02 -3.85700273e+00 2.27988972e+02 -1.00234320e+01 -2.98234121e+00 1.29857516e+02
1716.lowfreq: -1.0636 -0.0012 0.0004 0.0015 2.6895 4.6698 13.6227 19.3192 25.9703
frequency: 13.5105 19.2743 25.9202 37.0034 48.1934 56.0017 69.5041 77.5946 82.1062 87.4347 92.7715 116.4978 122.2468 143.9245 179.5358 198.7707 241.2340 242.7367 249.7475 268.9048 272.8333 297.3230 322.5206 338.8206 354.8968 366.5122 384.3698 413.7234 417.7219 427.5232 476.7386 500.5647 518.1016 527.0096 572.0971 602.9128 623.7977 629.6226 632.8029 680.1651 680.9720 725.6312 755.6747 759.0122 766.0425 795.1415 797.8863 798.2350 805.7785 836.5361 840.2662 847.5255 847.8329 860.2110 887.8292 893.1331 949.1815 974.9209 980.6571 990.2698 1001.8877 1004.3182 1016.2739 1023.1983 1023.4943 1060.8571 1064.0908 1104.3806 1111.8829 1112.1682 1113.2842 1123.4840 1136.3179 1136.3296 1174.0630 1182.3302 1217.9485 1245.2660 1248.6381 1248.7718 1249.0227 1294.9967 1298.1002 1315.6790 1358.6415 1359.3417 1359.9015 1374.2848 1398.8742 1399.1902 1400.0392 1423.2905 1426.0360 1463.4083 1463.5847 1473.7947 1473.8687 1486.7104 1486.7814 1494.5601 1495.7445 1524.6226 1556.1768 1585.5487 1601.8384 1614.3028 1617.9765 1622.1526 1652.6826 2988.1466 2994.2232 2994.6984 3007.9083 3008.3040 3065.4884 3065.7343 3090.9813 3091.2885 3105.1394 3105.9620 3112.2178 3129.5902 3154.5046 3155.8914 3158.5831 3178.2894 3178.9902 3189.4042 3540.6509
redmass: 3.6473 4.5436 5.1359 3.6892 3.1872 2.9642 3.5044 4.7350 5.3990 5.3750 4.1486 3.2204 4.2299 3.1750 4.2767 5.4315 1.6551 3.6295 1.2946 2.6192 5.1499 5.3050 5.2741 4.8018 4.6106 4.5581 4.4213 3.1115 3.0381 5.1712 5.2415 4.8985 3.0134 3.0401 6.3249 6.5997 1.2965 5.4040 6.4436 4.2290 4.0824 6.7112 5.1167 4.4039 5.2332 5.3348 1.1049 1.1108 4.8995 1.4387 1.3171 4.1474 4.0385 1.6938 1.4684 5.9109 1.4845 1.3632 1.3537 1.3626 3.0939 3.4401 1.3292 2.2849 2.2822 5.0579 5.2086 2.7868 1.9207 2.1854 1.5513 1.4762 1.4693 1.4688 1.1870 1.1485 2.5398 3.3204 1.2776 1.4671 1.6087 1.3225 1.3560 2.0072 2.1868 1.4440 2.0062 3.5513 1.3304 1.5015 1.3459 4.3205 4.3025 1.0404 1.0407 1.0593 1.0597 1.0982 1.0845 2.5186 2.1591 2.9175 7.6604 5.1273 5.1382 9.5321 8.5517 6.5663 5.9303 1.0876 1.0357 1.0358 1.0581 1.0581 1.1065 1.1064 1.0985 1.0985 1.1026 1.1025 1.0904 1.0885 1.0889 1.0908 1.0955 1.0942 1.0966 1.0957 1.0765
irintensity: 0.7624 1.1200 0.3811 0.8066 0.4085 0.1398 1.2978 2.9276 0.3909 0.4752 2.8724 0.6991 1.9093 0.3117 10.5641 1.4400 6.0723 11.5525 2.0511 13.1593 11.1811 1.1934 1.2868 1.4618 32.6879 4.3898 4.3272 1.0903 0.4515 3.4404 2.6253 3.2897 17.5056 2.9293 6.6132 2.0717 58.1289 7.0104 5.6579 42.6322 14.4569 0.9958 9.8692 13.2429 3.5038 8.1620 2.0077 2.0487 6.3665 33.5225 5.6557 13.8524 1.0349 46.4271 48.1726 11.3134 52.0804 0.0778 1.3580 0.8472 42.5273 33.0764 0.7805 17.3865 47.3688 828.5990 253.4470 62.7162 12.3112 7.5121 12.9142 16.0076 5.0388 6.0622 186.5294 138.5225 21.5356 1143.8769 14.5920 33.4225 36.6648 2.1005 1.6689 21.0965 8.0900 16.1078 3.8243 96.4624 99.2317 98.6833 41.5678 27.2906 26.9546 11.9458 12.1510 8.8189 5.4038 39.9576 10.1711 109.9753 7.6177 556.0841 23.2190 447.6795 907.5807 89.4703 207.5765 79.8849 315.5825 52.2825 26.8002 23.8428 28.7213 23.2288 9.0965 8.1771 35.7609 35.9669 46.3671 46.0306 18.6908 9.7297 5.4443 1.1612 5.7098 3.0039 3.0307 7.2611 40.7467
temp: 298.150 k
press: 1.00000 atm
elementType: 8 8 8 8 7 7 6 6 6 6 6 6 6 6 6 6 6 6 6 6 6 6 6 6 6 1 1 1 1 1 1 1 1 1 1 1 1 1 1 1 1 1 1 1 1
symmnumber: 1
zpe: 929868.3 jmol-1
zpe.correction: 0.354168 hartree
zpe.thermalcorrener: 0.378628 hartree
zpe.thermalcorrenthalpy: 0.379572 hartree
zpe.thermalcorrgfe: 0.295651 hartree
zpe.sumelectzpe: -1144.635292 hartree
zpe.sumelectthermal: -1144.610832 hartree
zpe.sumelectthermalent: -1144.609888 hartree
zpe.sumelectthermalfe: -1144.693809 hartree
dipole: 2.4288 -3.2728 -2.2574
dipole: 4.6590
quadrupole: -125.9899 -133.3113 -149.6015
quadrupole: -26.2722 5.1114 1.7666
quadrupole: 10.3110 2.9896 -13.3006 -26.2722 5.1114 1.7666
hfenergy: -1144.9894599 hartree
pointgroup: C01 [X(C19H20N2O4)]
dipole: 0.9577416 1.4796307 0.503208 debye
polarizability: 536.1645458|6.0533849|219.1461034|8.1407486|-28.2531394|138.6685519 unknown
InChI: InChI=1S/C19H20N2O4/c1-3-24-18(22)14-5-9-16(10-6-14)20-13-21-17-11-7-15(8-12-17)19(23)25-4-2/h5-13,20H,3-4H2,1-2H3
charge 0 multiplicity 1
45 atoms
O  7.001848 -0.480314 0.184489
O  -6.824174 -0.88547 0.549174
O  5.710585 -2.423254 0.201278
O  -7.081104 0.688132 -1.153344
N  1.240358 2.342772 0.036926
N  -0.669374 0.912255 0.119944
C  2.331168 1.438816 0.075311
C  4.61723 -0.242013 0.143062
C  3.641197 2.000476 0.083703
C  2.169654 0.025433 0.102221
C  4.77117 1.169831 0.117186
C  3.310711 -0.795163 0.134853
C  -4.870061 0.281876 -0.201795
C  -2.06795 0.744976 -0.005062
C  -4.085621 -0.446866 0.733727
C  -4.238742 1.228375 -1.050409
C  -2.702064 -0.224253 0.824067
C  -2.855827 1.458983 -0.958761
C  5.77999 -1.167481 0.178582
C  -0.126449 2.099727 0.032167
C  -6.335781 0.079192 -0.341985
C  8.224197 -1.33663 0.219092
C  -8.290996 -1.150452 0.476143
C  9.423532 -0.394234 0.21256
C  -8.597172 -2.221597 1.518134
H  3.767941 3.090921 0.063871
H  1.161327 -0.3912 0.100398
H  5.777111 1.597517 0.123872
H  3.207291 -1.885154 0.154653
H  1.499251 3.331389 0.02199
H  -4.5739 -1.18363 1.377373
H  -4.854508 1.764918 -1.780117
H  -2.084877 -0.782395 1.534815
H  -2.370892 2.16133 -1.646924
H  -0.719113 3.033808 -0.023433
H  8.183259 -1.964992 1.127388
H  8.20539 -2.006255 -0.659906
H  -8.535958 -1.475864 -0.551335
H  -8.826636 -0.203436 0.670756
H  9.406651 0.272354 1.091908
H  9.431246 0.228892 -0.698198
H  10.359818 -0.981093 0.239712
H  -8.329765 -1.874702 2.531028
H  -8.036297 -3.148262 1.307299
H  -9.676864 -2.458165 1.505385
