program: Gaussian 09
title: 000093794
version: EM64L-G09RevD.01
frameworkgroup: C1[X(C15H18N2O10)]
method: RPBEPBE
basis: SDD
operation: Freq
keyword: #p
keyword: freq=noraman
keyword: PBEPBE/SDD
title: #p freq=noraman PBEPBE/SDD
converged: NO NO NO NO
title: Mulliken charges:
elementType: O O O O O O O O O O N N C C C C C C C C C C C C C C C H H H H H H H H H H H H H H H H H H
charge: -0.226517 -0.226521 -0.169902 -0.169912 -0.178440 -0.178377 -0.178429 -0.178393 -0.228689 -0.228687 -0.137188 -0.137172 -0.370892 -0.384996 -0.384983 -0.311970 -0.311981 -0.499731 -0.499738 -0.499724 -0.499746 0.215756 0.215576 0.215726 0.215594 0.351130 0.351128 0.200862 0.200889 0.227209 0.227156 0.227173 0.227174 0.239789 0.239875 0.239874 0.239802 0.271451 0.270372 0.270368 0.271446 0.271468 0.270359 0.270381 0.271430
chargesum: 0.00000
title: Mulliken charges with hydrogens summed into heavy atoms:
elementType: O O O O O O O O O O N N C C C C C C C C C C C C C C C
charge: -0.226517 -0.226521 -0.169902 -0.169912 -0.178440 -0.178377 -0.178429 -0.178393 -0.228689 -0.228687 -0.137188 -0.137172 0.030859 0.069369 0.069364 0.167694 0.167695 0.042091 0.042076 0.042104 0.042065 0.215756 0.215576 0.215726 0.215594 0.351130 0.351128
polarizability: 2.98251741e+02 1.52387595e-02 1.98040036e+02 -3.28337456e-03 3.57732237e-02 1.45374851e+02
1716.lowfreq: -4.4933 -3.4793 -3.2341 -1.9144 -1.8033 -0.0300 -0.0016 4.0761 16.0380
frequency: -4.3486 4.0347 15.8605 17.2113 31.7768 45.5260 45.8630 53.0337 64.9948 69.3461 71.4891 81.8732 82.7657 98.2363 101.2356 106.6393 110.5787 116.7444 124.7884 157.5342 165.2103 177.5980 246.4339 283.6273 293.9158 293.9478 307.5127 333.8978 349.6409 380.9444 429.1200 449.2334 493.7500 534.1653 534.1689 549.1536 549.1701 549.5371 549.5578 587.7368 588.2340 631.5394 631.5832 662.3505 665.6736 673.9633 674.0231 723.4603 728.4373 747.1812 775.2731 818.8249 818.8509 842.6465 848.1482 855.0198 923.8521 929.3061 961.7405 997.0635 998.1583 1006.6270 1006.6279 1017.3013 1017.3136 1037.0004 1037.1531 1044.7250 1045.7996 1083.6121 1117.5214 1137.9840 1139.6820 1144.5771 1148.3160 1148.6123 1161.1028 1161.8765 1168.0556 1210.7387 1210.7430 1232.4899 1235.6433 1236.0369 1250.9614 1274.5825 1295.6535 1295.6739 1295.8169 1296.3463 1296.3502 1298.2008 1311.1054 1358.1540 1380.5322 1384.6661 1437.9253 1437.9275 1453.2795 1453.2944 1466.8087 1471.0823 1472.9623 1481.5249 1493.0711 1669.2744 1669.6556 1687.9667 1689.1218 1725.7629 1726.1863 2968.5185 3002.3674 3004.8703 3011.2814 3013.0256 3014.9842 3030.4859 3030.4868 3039.4369 3039.4403 3056.1012 3063.6847 3085.0007 3085.0009 3088.8215 3092.8784 3102.1228 3102.1246
redmass: 6.0050 9.9655 7.9539 5.3381 6.1981 5.5075 5.4140 2.9532 5.8219 3.8717 2.1777 2.6170 2.5727 6.8861 5.6878 3.8863 10.7640 1.8652 10.0846 4.2251 2.6559 7.7281 7.4914 5.0915 15.0882 15.1158 10.4192 8.3075 8.4335 7.5862 4.3873 5.4517 5.1136 3.5589 3.5589 4.3606 4.4372 2.7784 2.7972 11.5156 11.7707 6.3238 6.3241 9.7644 9.2498 11.6598 11.7668 8.9548 8.6117 1.0645 1.1069 1.4891 1.4891 1.1988 12.3668 11.6690 8.8132 10.1396 1.2131 3.2177 3.1447 2.1804 2.1803 5.5875 5.5839 4.5643 4.6737 5.3437 4.6377 2.4572 3.6538 6.9853 1.5591 4.8125 1.2156 1.3377 7.0886 11.3522 1.2683 1.1084 1.1084 1.2907 2.8508 2.8555 1.2618 1.1486 1.1171 2.4681 2.4732 1.4814 1.4820 1.0802 1.2965 1.3632 1.5768 1.4703 1.0731 1.0731 1.0905 1.0904 1.0859 1.0825 1.0745 1.0896 1.0988 12.6610 12.6608 11.8567 11.9087 12.5252 12.5199 1.0588 1.0600 1.0599 1.0565 1.0563 1.1010 1.0595 1.0595 1.0631 1.0631 1.1037 1.1056 1.1036 1.1036 1.1098 1.1083 1.1019 1.1019
irintensity: 0.3082 0.0000 0.0002 0.3159 5.8368 0.2230 0.0069 0.8677 6.2944 0.0019 1.6110 0.0006 0.7112 20.1873 3.9137 0.0332 0.1277 0.0002 0.6744 0.0000 4.1895 0.0031 16.7936 34.4417 0.0667 0.0082 0.2049 29.2849 0.0286 13.2505 0.7224 2.6149 0.8475 0.1290 0.1277 1.1985 1.5676 3.3459 1.5957 24.8550 0.3143 0.0024 98.0809 74.8048 2.8336 0.7617 40.4505 0.5461 2.1936 9.9782 0.0005 3.6496 28.8129 0.0194 41.5164 211.5298 26.3455 3.4249 0.0005 342.3857 0.5674 0.0559 0.0514 6.8869 0.2463 6.1504 345.4023 0.0660 97.7679 82.2579 0.0042 1224.2820 10.9343 53.6356 21.2323 2.0014 0.1683 462.5014 0.0104 0.0044 0.0070 0.1452 184.3673 3.3206 36.6207 0.0001 1.2575 86.8523 2.8787 0.3374 3.3790 0.0001 3.5462 0.4618 9.0025 2.9897 0.0307 1.3476 53.4697 6.4022 1.3398 1.5315 2.0548 4.8136 27.0577 0.0739 1161.9604 125.1984 350.6006 0.1593 15.2753 19.2315 0.4857 2.2352 3.5685 69.1281 10.8303 4.6342 17.6417 1.9803 0.8410 0.0005 4.7906 0.0018 0.0026 0.0022 87.3277 1.3951 9.4838
temp: 298.150 k
press: 1.00000 atm
elementType: 8 8 8 8 8 8 8 8 8 8 7 7 6 6 6 6 6 6 6 6 6 6 6 6 6 6 6 1 1 1 1 1 1 1 1 1 1 1 1 1 1 1 1 1 1
symmnumber: 1
zpe: 870924.7 jmol-1
zpe.correction: 0.331718 hartree
zpe.thermalcorrener: 0.358780 hartree
zpe.thermalcorrenthalpy: 0.359724 hartree
zpe.thermalcorrgfe: 0.266237 hartree
zpe.sumelectzpe: -1442.033239 hartree
zpe.sumelectthermal: -1442.006177 hartree
zpe.sumelectthermalent: -1442.005233 hartree
zpe.sumelectthermalfe: -1442.098720 hartree
dipole: 0.0001 0.0053 2.6361
dipole: 2.6361
quadrupole: -74.8718 -183.6443 -160.4761
quadrupole: -0.1234 -0.0045 -0.0203
quadrupole: 64.7923 -43.9802 -20.8120 -0.1234 -0.0045 -0.0203
hfenergy: -1442.364957 hartree
pointgroup: C01 [X(C15H18N2O10)]
dipole: -0.0001673 -0.0020256 -1.0371111 debye
polarizability: 298.2516276|0.1047941|198.0401399|-0.0299643|0.0379754|145.3748599 unknown
InChI: InChI=1S/C15H18N2O10/c18-10-4-5-11(19)16(10)26-14(22)24-8-2-1-3-9-25-15(23)27-17-12(20)6-7-13(17)21/h1-9H2
charge 0 multiplicity 1
45 atoms
O  -3.70128 0.002761 0.360025
O  3.699268 0.010227 0.358337
O  -5.862495 -0.001577 0.885711
O  5.860655 0.005788 0.882913
O  -7.43125 -2.366922 0.295614
O  -7.451036 2.349136 0.288751
O  7.439413 2.365165 0.295329
O  7.438909 -2.350903 0.282566
O  -5.241585 -0.004782 -1.422465
O  5.238651 0.014234 -1.424929
N  -7.201637 -0.007741 0.413772
N  7.199659 0.006839 0.410478
C  -0.001294 0.009351 -0.60756
C  -1.279524 0.005943 0.263818
C  1.277378 0.009732 0.263118
C  -2.53971 0.004611 -0.59682
C  2.537238 0.013455 -0.598058
C  -9.317549 -0.794074 -0.235479
C  -9.324134 0.758986 -0.23725
C  9.318637 0.784898 -0.238756
C  9.318828 -0.768171 -0.241611
C  -7.90675 -1.222647 0.179063
C  -7.916838 1.200537 0.175732
C  7.909911 1.218995 0.177098
C  7.909637 -1.204187 0.170835
C  -4.930431 -0.001818 -0.224429
C  4.928098 0.010681 -0.226752
H  -0.000069 -0.879282 -1.271529
H  -0.00289 0.900137 -1.268648
H  -1.289752 0.894719 0.921841
H  -1.286418 -0.884476 0.919673
H  1.284809 0.897945 0.921949
H  1.287824 -0.881262 0.918149
H  -2.622286 0.904877 -1.232392
H  -2.619969 -0.895371 -1.233056
H  2.618208 0.916025 -1.23051
H  2.618648 -0.884272 -1.23735
H  -9.537682 -1.225125 -1.226559
H  -10.041149 -1.226653 0.476251
H  -10.05101 1.186964 0.473923
H  -9.548365 1.185948 -1.229163
H  9.539687 1.215649 -1.229767
H  10.044592 1.214067 0.47263
H  10.043738 -1.199567 0.469516
H  9.541614 -1.195439 -1.233712
