program: Gaussian 09
title: 000093769
version: EM64L-G09RevD.01
frameworkgroup: C1[X(C7H10O2)]
method: RPBEPBE
basis: SDD
operation: Freq
keyword: #pfreq=noraman
keyword: PBEPBE/SDD
title: #p freq=noraman PBEPBE/SDD
converged: NO YES NO NO
title: Mulliken charges:
elementType: O O C C C C C C C H H H H H H H H H H
charge: -0.236977 -0.208405 -0.098074 -0.358364 -0.345105 -0.173136 -0.693317 -0.321964 0.169458 0.238050 0.196416 0.222811 0.241289 0.189691 0.259052 0.216238 0.205690 0.223760 0.272888
chargesum: 0.00000
title: Mulliken charges with hydrogens summed into heavy atoms:
elementType: O O C C C C C C C
charge: -0.236977 -0.208405 0.139976 0.060863 0.085875 0.085916 -0.047630 -0.049077 0.169458
polarizability: 1.03493679e+02 9.23904407e+00 7.80830603e+01 8.17431114e+00 1.15860620e+00 5.60615775e+01
1716.lowfreq: -16.6025 -12.5502 -0.0005 -0.0004 0.0004 9.5503 61.8589 82.9101 116.8414
frequency: 61.7855 82.8599 116.8361 152.8645 230.1574 269.8599 306.3450 371.5287 470.6429 511.6516 634.2925 674.3182 734.6835 761.9723 797.6724 810.1964 840.3866 897.1385 902.6292 955.7303 991.7200 1031.2044 1057.4290 1069.6824 1103.9621 1121.8708 1127.4555 1222.4592 1231.1655 1277.3535 1295.2216 1301.9323 1322.3549 1353.3200 1392.0700 1448.3569 1474.7949 1479.0254 1485.3593 1600.5145 1698.7618 2973.3350 2975.5021 2979.9564 2990.5327 3032.8775 3051.6161 3075.7352 3078.5664 3179.4920 3225.9846
redmass: 3.0669 1.9201 4.2231 3.4537 1.1315 3.4645 3.1332 4.0096 4.6385 2.8833 4.6241 3.2197 1.4755 2.9735 1.8348 3.8048 2.6422 1.9309 1.5858 1.3317 3.0967 1.5539 2.6792 2.6470 2.1044 1.6394 1.6902 1.3737 1.3973 1.2808 1.1769 1.3379 1.7478 1.5624 1.2123 1.0815 1.0503 1.0433 1.0814 6.8043 12.1262 1.0530 1.0435 1.0654 1.0836 1.0943 1.1012 1.1013 1.0990 1.0915 1.1062
irintensity: 1.0398 1.1349 3.2670 0.4421 0.0180 0.7518 0.7253 0.3521 2.3084 5.7296 1.9425 2.8226 16.5537 2.6391 73.0182 29.4149 48.4213 3.4348 7.8709 2.6358 27.0248 42.7922 28.0058 49.6983 4.2468 10.2024 6.3168 0.1241 2.0949 4.6596 0.3735 0.9646 2.3864 0.5491 10.7878 4.4184 4.3958 12.7261 15.4723 2.4806 395.9413 12.6559 37.6685 38.6560 13.6162 9.7861 5.0570 79.3177 44.9029 2.3280 1.9609
temp: 298.150 k
press: 1.00000 atm
elementType: 8 8 6 6 6 6 6 6 6 1 1 1 1 1 1 1 1 1 1
symmnumber: 1
zpe: 408124.9 jmol-1
zpe.correction: 0.155447 hartree
zpe.thermalcorrener: 0.164532 hartree
zpe.thermalcorrenthalpy: 0.165476 hartree
zpe.thermalcorrgfe: 0.120787 hartree
zpe.sumelectzpe: -422.483804 hartree
zpe.sumelectthermal: -422.474719 hartree
zpe.sumelectthermalent: -422.473775 hartree
zpe.sumelectthermalfe: -422.518464 hartree
dipole: 2.7962 4.8127 0.0752
dipole: 5.5666
quadrupole: -58.3331 -55.5522 -53.4198
quadrupole: -8.9041 0.8259 0.2502
quadrupole: -2.5648 0.2162 2.3486 -8.9041 0.8259 0.2502
hfenergy: -422.6392507 hartree
pointgroup: C01 [X(C7H10O2)]
dipole: -1.1118448 -1.8867511 0.0185522 debye
dipolederiv: -1.1279081 -0.1959902 0.173797 -0.02521 -0.4877614 -0.0439953 0.2403518 0.0253178 -0.37566 -0.8617637 -0.2932966 0.1094472 -0.5593269 -0.8425239 0.091649 0.140334 0.0416883 -0.3611965 0.1519143 0.0699235 0.0708169 0.3225755 0.300594 -0.0723592 0.1152056 -0.015098 0.3399444 0.0820935 0.0372665 -0.0448299 0.0929772 0.0996744 -0.0292391 0.0522374 -0.0346342 0.0462675 0.0455355 0.0087013 -0.0424979 -0.057423 0.0882923 -0.0321685 -0.1177171 -0.0404234 0.131648 0.1770342 0.1460429 -0.1055538 -0.0529288 0.0510749 0.0316189 -0.2346245 -0.0085524 -0.1289058 -0.0605396 0.0387981 -0.0405959 0.0854243 0.0845885 -0.0045891 0.0052403 -0.0075098 0.0492544 -0.1570356 -0.1091458 -0.0654125 -0.2285654 -0.4073622 0.040312 -0.0148647 0.010027 -0.1367401 1.4524449 0.4454954 -0.3185613 0.5580629 1.2325037 -0.0332823 -0.4151058 -0.0355923 0.3760831 0.0470629 -0.0453421 0.051933 -0.0318732 0.0402462 0.0115431 0.0377286 0.0532704 -0.0979918 -0.0019349 -0.0747386 -0.004589 -0.0642311 -0.149351 -0.0119208 -0.0072032 0.0039785 0.0824244 0.0348427 0.0037694 0.0512775 0.0152972 0.0625263 0.0531119 0.0331286 0.020769 -0.1178672 0.0392676 -0.0822667 -0.0211415 -0.0601539 -0.0855646 -0.0242292 -0.006399 -0.0067867 0.0766754 0.0300118 0.0200329 0.0171654 0.0123679 0.0473782 0.0896286 0.0356348 0.0505767 -0.1855913 0.1150824 -0.0393361 0.0167128 -0.015568 -0.043546 -0.0215346 0.0203856 -0.0239542 0.1535472 0.0672989 -0.0272444 0.0653529 -0.0207461 0.0752625 0.0644802 -0.0018547 0.0712355 -0.1520294 0.0258563 -0.0726943 -0.0257539 -0.1448485 -0.1383287 -0.0172105 -0.027548 0.0077462 0.0787344 -0.0941637 0.114799 0.0440812 0.1454205 -0.0112665 -0.0618954 0.0597606 -0.0711461 0.0547441 0.0349006 0.0552255 0.0683519 0.0287493 0.0835633 -0.0299196 0.0853099 -0.0409122 0.1666592 unknown
polarizability: 103.6512577|9.1187171|77.97893|-8.0118195|-0.9904222|56.0081285 unknown
InChI: InChI=1S/C7H10O2/c1-2-3-6-4-5-7(8)9-6/h4-6H,2-3H2,1H3
charge 0 multiplicity 1
19 atoms
O  0.550226 0.725537 0.470438
O  2.63821 1.5105 -0.25702
C  -0.121567 -0.607543 0.541083
C  -1.446322 -0.566293 -0.247931
C  -2.466706 0.428485 0.34845
C  0.914774 -1.572161 0.000246
C  -3.77287 0.482198 -0.470815
C  2.040166 -0.899946 -0.35677
C  1.863614 0.554865 -0.08084
H  -0.327266 -0.793709 1.614989
H  -1.876211 -1.589489 -0.253543
H  -1.223376 -0.300588 -1.299209
H  -2.002678 1.431022 0.392374
H  -2.693193 0.137927 1.394724
H  0.727941 -2.645621 -0.080086
H  -3.575789 0.803933 -1.510534
H  -4.26304 -0.509108 -0.511859
H  -4.491374 1.19597 -0.029209
H  2.960963 -1.293077 -0.786788
