program: Gaussian 09
title: 000093772
version: EM64L-G09RevD.01
frameworkgroup: C1[X(C9H14O2)]
method: RPBEPBE
basis: SDD
operation: Freq
keyword: #pfreq=noraman
keyword: PBEPBE/SDD
title: #p freq=noraman PBEPBE/SDD
converged: NO YES NO NO
title: Mulliken charges:
elementType: O O C C C C C C C C C H H H H H H H H H H H H H H
charge: -0.162577 -0.154592 0.319987 -0.456378 -0.166076 -0.530257 -0.730497 -0.735292 0.098115 0.065627 -0.717991 0.219060 0.210641 0.253275 0.239105 0.251414 0.219039 0.220185 0.214441 0.216000 0.225450 0.222320 0.222088 0.213392 0.243521
chargesum: 0.00000
title: Mulliken charges with hydrogens summed into heavy atoms:
elementType: O O C C C C C C C C C
charge: -0.162577 -0.154592 0.319987 -0.026676 0.087198 -0.039738 -0.076831 -0.071522 0.098115 0.065627 -0.038990
polarizability: 1.10051462e+02 -1.07030855e+00 1.01723244e+02 2.80893070e-01 1.62912752e+00 8.09040063e+01
1716.lowfreq: -16.0412 -6.4089 -0.0007 -0.0003 -0.0001 9.3621 53.1548 80.5208 144.0472
frequency: 53.0196 80.4525 144.0404 173.7956 195.7219 226.8086 227.3530 256.4167 268.1965 305.3725 325.6361 348.2284 362.3540 404.7657 425.2953 472.9580 544.1770 623.5344 710.4866 725.9221 777.0941 859.2595 886.1671 913.8790 931.4656 937.7233 954.6934 990.6307 1002.4399 1033.4450 1085.5129 1104.4797 1118.9299 1146.7493 1176.7012 1206.9376 1238.1265 1265.2921 1268.6166 1296.3212 1310.6006 1335.4070 1383.3106 1393.5936 1401.5710 1430.2397 1457.2420 1464.6420 1467.9217 1472.4912 1475.6563 1481.9721 1486.9101 1615.5792 1622.8967 2943.6561 2959.0532 2968.6686 2971.2318 2976.5663 2991.9087 3032.9213 3057.3581 3066.9876 3068.9239 3071.6577 3075.3700 3086.8661 3098.8723
redmass: 7.5209 3.5652 2.5283 1.1286 1.1014 2.3171 1.6860 1.7382 2.3377 4.5906 2.7329 3.0784 3.8986 2.1954 3.1305 2.9792 3.4682 4.0123 2.8389 4.0927 3.3289 2.0440 1.7899 2.0715 1.6497 1.6020 2.4423 1.8318 1.3759 1.5806 1.7073 1.9976 1.8334 2.0825 2.2197 2.5577 2.3599 1.4909 1.5559 1.7443 1.4911 1.7125 1.2008 1.2032 1.1997 1.0894 1.0708 1.0496 1.0460 1.0523 1.0621 1.0587 1.0564 11.1243 11.4162 1.0793 1.0628 1.0557 1.0389 1.0383 1.0360 1.1012 1.0971 1.0999 1.0998 1.0987 1.0988 1.1002 1.0994
irintensity: 0.7406 2.1647 0.6469 0.3857 0.0638 1.8962 0.8412 0.8549 2.1551 3.5536 3.6160 1.5139 0.4086 1.0170 0.1990 2.7846 5.3535 1.2871 4.2441 3.9554 0.1768 7.1881 3.0850 2.2203 1.5135 0.7968 20.6943 13.4939 2.9218 3.6900 11.3631 9.3987 9.4743 8.5643 1.0981 52.4940 13.6236 9.2847 7.3272 7.3781 5.0403 4.5684 22.7994 14.6114 16.5946 14.6525 1.2126 1.6580 2.5361 24.0299 7.4966 12.7124 13.6839 156.3181 74.0143 4.7741 13.3263 19.9736 53.9760 14.2281 25.7105 20.4605 8.0937 21.4187 2.7278 56.5072 63.3507 29.4844 19.9410
temp: 298.150 k
press: 1.00000 atm
elementType: 8 8 6 6 6 6 6 6 6 6 6 1 1 1 1 1 1 1 1 1 1 1 1 1 1
symmnumber: 1
zpe: 551712.2 jmol-1
zpe.correction: 0.210136 hartree
zpe.thermalcorrener: 0.222050 hartree
zpe.thermalcorrenthalpy: 0.222994 hartree
zpe.thermalcorrgfe: 0.173006 hartree
zpe.sumelectzpe: -500.928448 hartree
zpe.sumelectthermal: -500.916534 hartree
zpe.sumelectthermalent: -500.915590 hartree
zpe.sumelectthermalfe: -500.965578 hartree
dipole: 4.0101 -3.8533 -0.0465
dipole: 5.5616
quadrupole: -73.8376 -74.6592 -65.0177
quadrupole: 6.1563 -2.4556 -2.5583
quadrupole: -2.6661 -3.4877 6.1538 6.1563 -2.4556 -2.5583
hfenergy: -501.1385841 hartree
pointgroup: C01 [X(C9H14O2)]
dipole: -1.7782517 -1.2732782 0.0659029 debye
dipolederiv: -0.7763409 -0.0553761 -0.1499543 -0.0037899 -0.4792266 -0.0325487 -0.2489747 -0.0805605 -0.3120407 -0.5301207 -0.0718404 0.0857808 -0.131398 -0.7332969 0.1524396 0.1914441 0.2356672 -0.3513893 0.1379259 0.0528984 0.0468521 0.1279512 0.2079038 -0.0142119 0.0913035 0.0195364 0.1276732 0.1014968 0.0967523 0.0254657 0.0164081 0.0001877 -0.0166204 -0.0393704 -0.026831 0.101534 -0.1883515 -0.1112881 -0.0761546 -0.1224551 -0.1784692 -0.0777046 -0.0948268 -0.1101989 0.0942382 -0.3872643 -0.154154 0.1448523 -0.1092024 -0.0960272 0.0350266 0.1584493 0.0515932 -0.0076947 -0.0397065 -0.0048183 0.0430454 -0.0095378 0.0341071 0.0083646 0.0110369 -0.0028006 0.030853 0.0174831 0.0015414 -0.0048662 0.0105094 0.0159557 0.0266034 -0.0191635 0.0187579 -0.0815457 0.7186236 0.1960638 0.2905003 0.162535 0.6380701 0.1621303 0.4019208 0.1924181 0.1837798 0.8104213 0.0721178 -0.2630544 0.0840413 0.6149046 -0.239381 -0.3617838 -0.3501775 0.2657644 -0.0311568 0.0342107 -0.0028549 0.0461779 -0.0083783 0.0236832 0.02981 0.0098919 0.0779399 -0.0141522 -0.1059084 -0.0256537 -0.0861197 -0.1063362 -0.0497617 -0.0260425 -0.0786313 0.0518356 0.0282368 0.0177441 -0.0338916 0.0134888 0.0675867 0.0150467 -0.0035754 0.0632052 -0.1577256 0.099581 0.0029159 -0.0303738 -0.0349999 0.0363453 0.0507272 -0.0171866 0.0581037 -0.092687 0.0673484 -0.0170765 -0.0309507 0.0199758 0.1186676 0.0377832 -0.0406452 -0.005255 -0.0956348 -0.0263635 0.085791 -0.0051628 0.077476 -0.0699555 0.0141749 -0.0349172 0.04899 0.0877633 0.0034874 -0.0825066 -0.0072209 -0.1426019 -0.0799125 -0.0534627 -0.0401162 -0.0811505 0.0550317 -0.0286001 0.0920055 0.0057898 0.1585323 -0.0710703 0.0183081 -0.0177384 0.044257 0.0821171 0.0658687 0.0051994 -0.0721663 -0.0043117 0.0897853 0.0277969 -0.0054452 0.0302877 -0.1648369 0.0494722 -0.0794489 -0.0499487 -0.1167491 -0.0860751 -0.0982973 -0.0408448 -0.0469953 0.0416644 -0.086122 -0.0352509 0.1256695 -0.0419113 0.0851227 0.0107297 0.1069516 0.0122389 0.0027072 -0.0224673 0.1156127 -0.0527532 0.1397517 -0.0514011 0.0513393 -0.0039106 0.003229 0.0731682 0.0869123 0.0173394 0.0090994 0.0135497 0.0662438 -0.0153315 -0.0274427 0.0544343 -0.1323073 0.0453544 -0.1117982 -0.0532553 -0.0491006 -0.1080921 -0.0592611 -0.0452484 -0.0675798 0.0597035 -0.1015661 0.0392739 0.0812062 -0.01822 0.0933608 0.0224272 0.0763163 0.00757 0.0600882 unknown
polarizability: 110.1724015|-0.083698|101.2993943|0.5942523|-2.945253|81.2069167 unknown
InChI: InChI=1S/C9H14O2/c1-6-4-9(2,3)5-7(10)8(6)11/h6H,4-5H2,1-3H3
charge 0 multiplicity 1
25 atoms
O  2.588204 0.169532 0.58732
O  0.970987 2.397362 -0.561247
C  -1.58977 -0.079092 0.031431
C  -0.675458 -1.311625 0.304168
C  0.754561 -1.216022 -0.31159
C  -0.870465 1.210362 0.554777
C  -2.922702 -0.256429 0.801667
C  -1.895822 0.071152 -1.482885
C  1.420534 0.090609 0.130696
C  0.53415 1.35575 -0.011116
C  1.622282 -2.447951 0.004878
H  -1.164394 -2.223334 -0.091058
H  -0.57668 -1.453045 1.400707
H  0.633557 -1.134007 -1.414857
H  -0.782295 1.135703 1.660276
H  -1.451348 2.120813 0.320811
H  -3.466514 -1.149905 0.441976
H  -3.582376 0.619506 0.659115
H  -2.746866 -0.378709 1.886989
H  -2.373836 -0.845756 -1.875187
H  -0.989241 0.26678 -2.084398
H  -2.588633 0.915277 -1.655447
H  1.748744 -2.566892 1.095971
H  1.151797 -3.364347 -0.394575
H  2.630084 -2.348832 -0.432322
