program: Gaussian 09
title: 000093778
version: EM64L-G09RevD.01
frameworkgroup: C1[X(C11H15N3O2)]
method: RPBEPBE
basis: SDD
operation: Freq
keyword: #p
keyword: freq=noraman
keyword: PBEPBE/SDD
title: #p freq=noraman PBEPBE/SDD
converged: YES YES NO NO
title: Mulliken charges:
elementType: O O N N N C C C C C C C C C C C H H H H H H H H H H H H H H H
charge: -0.227414 -0.227829 -0.129565 -0.553619 0.002555 -0.112145 -0.399288 -0.404226 -0.416036 -0.432219 0.391558 0.199452 -0.339739 -0.347934 -0.241648 -0.240459 0.201964 0.191582 0.241963 0.203780 0.225123 0.242306 0.208624 0.210437 0.229913 0.259071 0.263939 0.245625 0.283584 0.231411 0.239236
chargesum: 0.00000
title: Mulliken charges with hydrogens summed into heavy atoms:
elementType: O O N N N C C C C C C C C C C C
charge: -0.227414 -0.227829 -0.129565 -0.030609 0.002555 0.089818 0.034257 0.024676 0.034894 0.008131 0.391558 0.199452 -0.094114 -0.064350 -0.010238 -0.001223
polarizability: 2.18355908e+02 -1.47714272e+00 1.66638553e+02 -1.11519729e+00 -1.03322043e+00 8.85687300e+01
1716.lowfreq: -8.3588 -2.1476 -0.0006 0.0003 0.0006 11.2804 37.5416 56.3122 69.5972
frequency: 37.3160 56.2906 69.5938 108.2722 154.9653 168.5956 226.6679 233.3271 243.1871 262.2384 302.9919 323.6909 344.6774 381.4262 405.2274 440.2508 444.4298 462.5094 508.7537 534.5956 552.6381 614.3319 635.4339 656.3290 666.3863 713.0527 727.5151 765.8430 785.5489 792.7594 814.4650 850.6354 919.6481 932.3251 965.1076 971.6562 982.7615 984.7187 1033.3338 1041.5548 1048.6033 1065.4034 1100.2445 1124.8586 1130.7436 1148.0738 1162.7495 1175.7080 1180.6511 1196.2668 1237.0744 1249.2883 1267.6934 1277.3674 1305.2214 1327.6527 1336.8823 1339.5388 1344.8137 1360.2552 1375.5329 1388.0493 1392.9436 1440.6556 1447.6409 1459.2566 1471.1149 1475.9746 1497.5698 1559.8578 1612.9853 1640.9817 2906.0757 2912.3270 2961.4870 2988.7129 2995.7127 3061.4996 3070.7619 3072.2102 3122.2450 3136.0467 3161.3228 3171.4604 3186.0933 3426.8797 3551.8218
redmass: 6.2003 5.3334 5.1079 3.5173 4.1593 3.7607 2.0873 2.7068 2.8404 2.3745 2.7435 3.4837 2.3845 4.9830 4.0559 3.6755 2.0054 2.8018 3.8548 3.4861 5.5964 3.0766 5.0691 1.4830 5.3937 4.7633 4.6299 1.3817 5.8975 1.9374 1.8468 1.4292 2.9785 1.9215 1.3595 1.6577 2.3057 1.3490 1.8275 2.4513 2.0542 2.3848 3.2631 3.1915 1.8544 1.6301 1.5196 1.1921 2.1949 3.6268 1.4340 1.3263 1.3523 1.7004 1.2796 1.4864 3.3346 1.4046 1.5493 1.3459 2.9455 1.6020 2.2271 2.7769 1.0968 1.0933 1.1204 1.2286 2.3814 6.6664 6.2984 1.0931 1.0723 1.0700 1.0833 1.0622 1.0620 1.1001 1.0989 1.0939 1.0884 1.0871 1.0898 1.0943 1.0978 1.0449 1.0964
irintensity: 1.1761 0.6217 1.7258 2.0941 4.8405 3.1234 21.2477 9.6106 12.9524 14.0392 6.1306 12.1800 1.6254 1.1209 11.6789 0.5210 4.7087 1.3941 1.7597 12.7261 3.7409 5.1550 9.2243 290.5266 12.6802 0.7193 10.6707 74.4511 13.9571 16.2098 2.7866 2.3689 33.7361 13.4177 1.5725 0.6843 19.7641 5.2281 19.7594 5.2750 4.0547 10.5687 15.5646 3.9274 24.6816 19.2952 26.8183 5.9278 188.1503 194.1141 17.7292 15.6499 13.3394 39.7129 1.7408 53.0127 55.0095 2.7921 25.3844 25.5495 11.7552 3.4433 4.1023 2.5167 6.9347 17.7434 30.2930 96.6593 114.3476 66.1309 113.6734 39.6799 43.4226 99.0321 28.3845 36.6219 38.8915 34.5593 18.4227 40.6435 10.8108 8.3308 13.3572 7.6177 10.8216 1.1141 0.1403
temp: 298.150 k
press: 1.00000 atm
elementType: 8 8 7 7 7 6 6 6 6 6 6 6 6 6 6 6 1 1 1 1 1 1 1 1 1 1 1 1 1 1 1
symmnumber: 1
zpe: 663815.9 jmol-1
zpe.correction: 0.252834 hartree
zpe.thermalcorrener: 0.267190 hartree
zpe.thermalcorrenthalpy: 0.268135 hartree
zpe.thermalcorrgfe: 0.211471 hartree
zpe.sumelectzpe: -741.571783 hartree
zpe.sumelectthermal: -741.557426 hartree
zpe.sumelectthermalent: -741.556482 hartree
zpe.sumelectthermalfe: -741.613145 hartree
dipole: -1.0034 -4.2355 1.4311
dipole: 4.5819
quadrupole: -90.3957 -99.6655 -94.5195
quadrupole: -13.3570 -3.2304 1.7228
quadrupole: 4.4645 -4.8053 0.3408 -13.3570 -3.2304 1.7228
hfenergy: -741.8246167 hartree
pointgroup: C01 [X(C11H15N3O2)]
dipole: 0.3432956 1.7693695 -0.0333108 debye
polarizability: 218.4057421|0.2872681|158.5347871|0.0720285|-23.7766164|96.6226613 unknown
InChI: InChI=1S/C11H15N3O2/c12-9-5-7-13(8-6-9)10-3-1-2-4-11(10)14(15)16/h1-4,9H,5-8,12H2
charge 0 multiplicity 1
31 atoms
O  -2.055864 -2.745183 1.017143
O  -0.021796 -2.203768 0.153896
N  0.541392 0.607626 0.110797
N  4.762679 -0.263191 -0.279416
N  -1.226614 -1.879833 0.515138
C  3.486724 0.329909 0.176584
C  2.546381 -0.647965 0.93463
C  2.731562 0.915608 -1.034941
C  1.21752 0.039527 1.304406
C  1.388691 1.567845 -0.633695
C  -0.845076 0.605816 -0.038814
C  -1.710897 -0.508911 0.28016
C  -1.509145 1.789232 -0.513792
C  -3.126442 -0.379907 0.239242
C  -2.904113 1.887716 -0.592943
C  -3.732028 0.806279 -0.191086
H  3.745725 1.166566 0.860388
H  3.040172 -1.006592 1.859069
H  2.329017 -1.52568 0.29957
H  2.528431 0.102674 -1.76066
H  3.370168 1.665282 -1.536569
H  0.548943 -0.656952 1.826462
H  1.425561 0.884297 2.003595
H  1.585276 2.475357 -0.016684
H  0.861199 1.885074 -1.547891
H  4.627678 -1.027557 -0.9531
H  5.375952 -0.557536 0.489545
H  -0.907875 2.668826 -0.758449
H  -3.718776 -1.255554 0.516874
H  -3.354516 2.824853 -0.938889
H  -4.821929 0.887838 -0.23287
