program: Gaussian 09
title: 000093775
version: EM64L-G09RevD.01
frameworkgroup: C1[X(C13H17NO2)]
method: RPBEPBE
basis: SDD
operation: Freq
keyword: #p
keyword: freq=noraman
keyword: PBEPBE/SDD
title: #p freq=noraman PBEPBE/SDD
converged: YES YES NO NO
title: Mulliken charges:
elementType: O O N C C C C C C C C C C C C C H H H H H H H H H H H H H H H H H
charge: -0.290556 -0.264684 -0.128720 -0.404155 -0.375427 -0.373360 -0.387921 -0.415857 0.127792 0.266627 -0.318753 -0.379091 -0.369866 -0.351970 0.330597 -0.537626 0.192533 0.221244 0.208895 0.202189 0.202053 0.200041 0.266765 0.203879 0.218756 0.256033 0.249104 0.263687 0.252179 0.242460 0.224715 0.246105 0.222331
chargesum: 0.00000
title: Mulliken charges with hydrogens summed into heavy atoms:
elementType: O O N C C C C C C C C C C C C C
charge: -0.290556 -0.264684 -0.128720 0.009621 0.035657 0.028734 0.082723 0.058932 0.127792 0.266627 -0.069649 -0.115404 -0.117687 -0.109509 0.330597 0.155525
polarizability: 2.29741604e+02 -3.17323857e+00 1.44331949e+02 3.18484308e+00 7.40945826e+00 9.85554520e+01
1716.lowfreq: -10.5641 -6.5643 -0.0007 -0.0007 -0.0005 3.2399 38.3568 51.7028 60.2413
frequency: 38.3541 51.6445 60.1881 83.3496 103.0888 157.9786 179.1322 218.7496 232.0624 256.8011 276.6002 296.2214 325.8444 366.3151 399.3242 422.1903 436.7211 457.8800 477.4870 514.8993 560.5502 577.6480 627.0927 664.8245 691.7015 754.0740 771.2767 805.7549 821.2050 823.3945 839.8708 847.5108 877.9141 914.5177 949.3309 957.0626 971.9512 985.3822 994.9172 1007.7850 1040.1904 1087.3489 1104.6355 1112.2882 1112.3593 1124.7099 1153.4246 1156.8984 1163.9436 1176.9819 1230.1998 1234.3097 1252.0864 1262.5937 1268.7307 1300.4975 1325.3117 1336.0978 1342.2982 1344.6461 1356.6844 1368.2312 1404.5248 1418.7012 1436.6961 1455.5099 1460.8400 1465.3562 1467.8463 1472.9734 1476.9461 1484.5871 1500.4769 1542.6872 1579.6419 1618.8413 2930.4422 2947.2756 2962.4903 2968.5154 2980.3565 2987.0011 3036.5205 3044.4628 3051.9288 3053.9572 3087.9829 3095.0961 3126.7124 3134.5179 3148.0178 3166.1393 3169.8247
redmass: 3.5037 4.0114 3.3927 5.2184 3.6910 3.6327 3.7924 1.6808 2.1332 1.9117 2.8264 4.5000 3.5148 5.0608 1.8893 2.8561 3.0412 3.7928 3.0404 2.2759 3.2918 4.0878 6.7322 3.4659 5.1551 4.3748 5.3124 1.5026 2.6325 1.4008 1.6627 1.4681 3.1250 2.5885 1.3314 1.3830 1.3451 7.5395 2.9594 2.4194 2.0390 1.3806 2.1491 1.3550 1.2694 2.4064 1.2761 1.3540 2.2531 1.2429 2.5263 3.1112 1.4110 1.6934 1.1947 1.2808 1.2655 1.3681 1.5539 1.4447 1.3740 5.2441 2.7903 4.0247 1.1865 1.0911 1.0867 1.0970 1.0499 1.0762 1.0817 1.1213 2.4641 8.4351 7.4085 6.3923 1.0717 1.0701 1.0328 1.0636 1.0613 1.0612 1.0959 1.1021 1.1041 1.1032 1.0919 1.0903 1.0997 1.0886 1.0877 1.0953 1.0963
irintensity: 2.5975 0.8389 0.2294 2.7910 5.8996 2.3409 2.8475 2.3272 0.1398 2.3990 3.1306 0.2515 8.5760 3.9169 3.5291 0.5417 0.7222 3.6918 3.9175 13.2722 4.5061 26.8590 2.6887 2.7691 14.5835 11.2410 5.3975 0.3018 2.1449 10.1772 56.6870 23.3628 10.1615 4.9576 6.5798 4.2319 2.3717 70.6497 30.4221 4.1969 6.1554 0.5900 51.8358 9.4132 1.0588 3.5644 0.5802 1.7048 0.6075 129.7104 52.1782 135.3468 68.5856 168.9237 8.0687 1.7463 1.3374 1.8068 18.0482 1.3867 9.3299 8.9322 253.1625 0.2360 7.3047 7.1519 11.6481 14.9587 13.7519 44.2660 5.4199 25.9270 31.0955 195.5211 48.0344 141.0397 46.5999 63.1198 71.3547 41.2002 30.0295 35.0897 64.8831 36.7416 45.4181 90.6795 9.2463 13.6868 25.1243 10.1832 3.9647 11.8493 6.2301
temp: 298.150 k
press: 1.00000 atm
elementType: 8 8 7 6 6 6 6 6 6 6 6 6 6 6 6 6 1 1 1 1 1 1 1 1 1 1 1 1 1 1 1 1 1
symmnumber: 1
zpe: 725714.2 jmol-1
zpe.correction: 0.276410 hartree
zpe.thermalcorrener: 0.291253 hartree
zpe.thermalcorrenthalpy: 0.292197 hartree
zpe.thermalcorrgfe: 0.233895 hartree
zpe.sumelectzpe: -709.578311 hartree
zpe.sumelectthermal: -709.563468 hartree
zpe.sumelectthermalent: -709.562524 hartree
zpe.sumelectthermalfe: -709.620826 hartree
dipole: 0.5296 -2.8059 1.8518
dipole: 3.4034
quadrupole: -68.9123 -103.9787 -95.9139
quadrupole: 9.3888 2.8640 4.0129
quadrupole: 20.6893 -14.3771 -6.3122 9.3888 2.8640 4.0129
hfenergy: -709.8547207 hartree
pointgroup: C01 [X(C13H17N1O2)]
dipole: 0.23376 -1.2940994 0.2521564 debye
polarizability: 229.7044647|-2.3326592|132.0474247|4.8420193|21.4959009|110.8771151 unknown
InChI: InChI=1S/C13H17NO2/c1-16-12-7-5-11(6-8-12)13(15)14-9-3-2-4-10-14/h5-8H,2-4,9-10H2,1H3
charge 0 multiplicity 1
33 atoms
O  -1.076552 2.307006 0.716063
O  4.423405 -0.850823 -0.339773
N  -2.019939 0.189239 0.472068
C  -4.259252 -1.469345 -0.411391
C  -4.247082 0.065133 -0.614765
C  -2.816382 -2.026487 -0.347414
C  -3.384846 0.7652 0.45949
C  -1.989634 -1.270873 0.717169
C  -0.92317 1.05157 0.538438
C  0.458344 0.481967 0.349699
C  0.772791 -0.484158 -0.645789
C  1.515971 1.037137 1.109734
C  2.098668 -0.900007 -0.854554
C  2.849819 0.617573 0.927023
C  3.14126 -0.359741 -0.059193
C  5.543303 -0.313666 0.438689
H  -4.781834 -1.706687 0.538834
H  -4.827894 -1.962848 -1.22179
H  -3.837161 0.306352 -1.614969
H  -5.276715 0.46907 -0.573523
H  -2.827203 -3.106345 -0.104333
H  -2.328882 -1.913377 -1.336327
H  -3.288098 1.847234 0.277521
H  -3.849797 0.63311 1.460901
H  -2.432415 -1.465645 1.71997
H  -0.948233 -1.623252 0.745481
H  -0.02038 -0.885344 -1.286685
H  1.278137 1.819527 1.837859
H  2.353986 -1.629403 -1.629053
H  3.642394 1.059159 1.538095
H  5.651576 0.777645 0.286998
H  6.433682 -0.831897 0.053904
H  5.422733 -0.529321 1.518019
