program: Gaussian 09
title: 000093760
version: EM64L-G09RevD.01
frameworkgroup: C1[X(C16H20FNO)]
method: RPBEPBE
basis: SDD
operation: Freq
keyword: #p
keyword: freq=noraman
keyword: PBEPBE/SDD
title: #p freq=noraman PBEPBE/SDD
converged: NO YES NO NO
title: Mulliken charges:
elementType: F O N C C C C C C C C C C C C C C C C H H H H H H H H H H H H H H H H H H H H
charge: -0.197113 -0.216256 -0.098459 0.001648 -0.481265 -0.207514 -0.428230 -0.409864 -0.442912 -0.363670 -0.424110 -0.391836 0.090214 0.313854 -0.319097 -0.332838 -0.400145 -0.373423 0.331809 0.199436 0.217038 0.219232 0.227846 0.197556 0.192757 0.204699 0.235091 0.208136 0.208497 0.170577 0.210265 0.213920 0.193704 0.192155 0.202819 0.248842 0.284709 0.260076 0.261851
chargesum: 0.00000
title: Mulliken charges with hydrogens summed into heavy atoms:
elementType: F O N C C C C C C C C C C C C C C C C
charge: -0.197113 -0.216256 -0.098459 0.201084 -0.044995 0.020332 -0.037917 0.029926 -0.026279 0.017172 -0.016486 0.003137 0.090214 0.313854 -0.070255 -0.048129 -0.140068 -0.111572 0.331809
polarizability: 2.27571869e+02 -2.32716775e+01 1.49459956e+02 1.20139590e-01 9.23365185e+00 1.53780228e+02
1716.lowfreq: -0.0006 -0.0004 0.0005 3.1698 6.4981 15.5450 26.6973 48.3321 61.8086
frequency: 24.8594 48.0549 61.7414 77.2282 106.6979 134.5687 150.0582 202.9790 237.4189 267.6047 286.1470 307.9219 319.1576 335.2455 345.2305 375.5355 408.2783 412.5043 418.8376 461.9164 468.9307 481.0946 499.2812 536.3275 553.4330 609.3767 625.5322 670.1472 712.4154 732.3073 784.1805 802.6682 819.0063 824.0110 825.6082 846.1902 855.9303 872.5206 883.7385 911.7490 953.1531 955.4975 970.0000 989.1607 1003.0659 1004.4253 1020.8740 1025.9279 1060.0866 1072.0543 1094.5673 1104.7582 1111.0836 1123.8047 1132.4273 1142.8729 1155.9726 1163.5988 1176.8571 1200.1505 1207.1385 1217.5327 1225.7047 1250.9977 1267.4679 1269.4303 1287.5600 1293.2886 1298.0667 1329.5661 1334.0440 1339.2510 1344.6612 1347.9338 1348.2012 1357.7680 1365.9507 1379.3051 1395.3741 1408.7808 1443.1496 1449.3190 1455.4749 1462.0210 1463.9944 1473.5263 1485.7440 1488.6770 1565.1939 1598.8079 1610.5240 2801.8142 2829.8564 2909.9835 2965.9047 2968.4362 2973.4015 2985.2424 2988.1358 2997.1798 3016.9578 3020.5351 3031.0302 3037.3766 3049.7667 3052.5872 3060.5885 3156.6362 3157.8168 3177.8010 3180.9530
redmass: 5.9229 4.1583 3.3918 5.0252 7.8066 4.0373 3.3799 3.0274 2.8714 2.8810 5.5845 3.1666 2.0170 1.7795 4.2534 6.6371 3.7499 3.1515 4.4206 3.5001 3.9120 2.4460 2.9120 2.3578 2.3484 3.7428 7.0947 4.1276 3.2074 4.0610 3.8385 3.2363 1.4046 1.6984 1.5951 2.5179 1.8859 1.9124 2.2172 2.4004 1.4586 1.6589 2.7628 1.3580 2.2733 2.3580 2.0500 1.9590 1.9616 1.4916 2.0286 1.4341 1.8508 2.0272 2.2522 2.6284 1.4927 1.3411 1.4564 1.9027 1.8720 1.3753 1.9979 1.5678 1.2251 1.2728 1.3522 1.2671 1.4260 1.4034 1.4010 1.4837 1.3545 1.4115 1.4863 1.6485 1.6675 4.3330 1.4729 4.0558 1.0877 1.0956 1.0935 1.0883 1.0877 1.0932 1.1170 2.4840 8.6874 7.2860 7.1105 1.0793 1.0709 1.0676 1.0770 1.0612 1.0621 1.0620 1.0608 1.0677 1.0880 1.0877 1.0970 1.1016 1.1021 1.1030 1.1021 1.0883 1.0889 1.0963 1.0974
irintensity: 0.0585 0.2513 0.6057 2.1784 2.3867 0.7411 0.6131 1.6582 1.4702 0.4306 2.9246 7.2043 0.9383 3.5992 1.3435 2.8787 0.5120 0.7131 1.7687 0.5083 0.5811 1.3379 13.4145 8.8300 8.5127 13.9295 0.4840 8.2439 5.1093 1.2021 11.2718 19.4811 8.9459 2.6396 4.1572 26.5680 39.2823 4.7411 1.9804 7.9819 10.6870 16.0614 42.6718 0.6420 20.1869 1.0152 2.3482 34.2266 4.1712 8.7392 10.2499 19.1286 9.8640 14.4999 14.8211 12.8439 83.0021 3.1759 11.8148 10.3880 139.2835 5.6246 111.1957 0.3657 5.0759 2.5936 12.9162 4.0677 7.2751 16.0628 11.5564 5.0611 2.8649 2.1766 15.1729 3.8655 8.4696 17.0237 0.4435 12.2779 7.4318 10.0883 3.2266 16.4098 9.8878 3.6378 12.1538 35.1490 117.6741 61.7558 59.7161 53.5796 106.1688 50.4056 30.1167 34.1537 20.7933 33.2757 36.8056 41.3996 9.8714 125.9495 31.5863 45.5137 32.2434 88.6927 32.0492 7.9044 0.0063 4.2429 3.9190
temp: 298.150 k
press: 1.00000 atm
elementType: 9 8 7 6 6 6 6 6 6 6 6 6 6 6 6 6 6 6 6 1 1 1 1 1 1 1 1 1 1 1 1 1 1 1 1 1 1 1 1
symmnumber: 1
zpe: 860612.8 jmol-1
zpe.correction: 0.327790 hartree
zpe.thermalcorrener: 0.344225 hartree
zpe.thermalcorrenthalpy: 0.345170 hartree
zpe.thermalcorrgfe: 0.283199 hartree
zpe.sumelectzpe: -850.093480 hartree
zpe.sumelectthermal: -850.077044 hartree
zpe.sumelectthermalent: -850.076100 hartree
zpe.sumelectthermalfe: -850.138071 hartree
dipole: 0.5068 1.0032 1.4443
dipole: 1.8301
quadrupole: -119.9186 -116.5927 -107.9881
quadrupole: 2.7618 -2.3174 -2.3736
quadrupole: -5.0855 -1.7596 6.8451 2.7618 -2.3174 -2.3736
hfenergy: -850.4212697 hartree
pointgroup: C01 [X(C16H20F1N1O1)]
dipole: -0.1932704 -0.3099034 0.6204892 debye
polarizability: 228.448565|-21.4244787|145.9701971|3.4880179|-8.124906|156.3932906 unknown
InChI: InChI=1S/C16H20FNO/c17-14-6-4-12(5-7-14)16(19)13-8-10-18-9-2-1-3-15(18)11-13/h4-7,13,15H,1-3,8-11H2
charge 0 multiplicity 1
39 atoms
F  5.786563 -1.274142 0.105373
O  0.332635 1.6548 -1.504957
N  -3.082921 0.374191 0.135435
C  -1.983592 -0.630502 0.207021
C  -0.898524 -0.142666 1.192159
C  -0.314139 1.259846 0.826115
C  -2.527486 -2.002289 0.669908
C  -2.574747 1.696423 -0.325451
C  -1.482525 2.252094 0.607134
C  -4.199922 -0.073246 -0.738647
C  -3.691677 -2.49287 -0.216536
C  -4.7941 -1.413178 -0.268447
C  0.643962 1.178708 -0.371829
C  1.988883 0.516804 -0.193477
C  2.498125 0.112231 1.07107
C  2.785158 0.309515 -1.354071
C  3.77082 -0.485577 1.180477
C  4.054772 -0.290337 -1.267788
C  4.517435 -0.674984 0.004502
H  -1.519944 -0.76503 -0.809145
H  -0.098838 -0.904581 1.251971
H  -1.365438 -0.062573 2.193567
H  0.283123 1.608943 1.693859
H  -2.881477 -1.903146 1.715995
H  -1.697309 -2.735602 0.666914
H  -3.429652 2.39937 -0.34019
H  -2.17083 1.634501 -1.363099
H  -1.101602 3.200329 0.185243
H  -1.935412 2.47096 1.593123
H  -3.857499 -0.181268 -1.802713
H  -4.976042 0.715553 -0.725568
H  -4.094536 -3.448409 0.169548
H  -3.32069 -2.689095 -1.243871
H  -5.609655 -1.716188 -0.952769
H  -5.2325 -1.279975 0.739647
H  1.913928 0.269587 1.982406
H  2.380594 0.635131 -2.317531
H  4.181007 -0.797866 2.144818
H  4.677652 -0.458561 -2.150796
