program: Gaussian 09
title: 000093763
version: EM64L-G09RevD.01
frameworkgroup: C1[X(C16H15BrF2)]
method: RPBEPBE
basis: SDD
operation: Freq
keyword: #p
keyword: freq=noraman
keyword: PBEPBE/SDD
title: #p freq=noraman PBEPBE/SDD
converged: YES YES NO NO
title: Mulliken charges:
elementType: Br F F C C C C C C C C C C C C C C C C H H H H H H H H H H H H H H H
charge: -0.037275 -0.205612 -0.204777 -0.377861 -0.422631 0.476278 0.526915 -0.314084 -0.371092 -0.425135 -0.383697 -0.353571 -0.705697 -0.371997 -0.370667 -0.392568 -0.369169 0.317705 0.314666 0.223751 0.203650 0.212774 0.252280 0.216659 0.242144 0.240650 0.248774 0.249423 0.279182 0.277305 0.256107 0.257348 0.254898 0.255323
chargesum: 0.00000
title: Mulliken charges with hydrogens summed into heavy atoms:
elementType: Br F F C C C C C C C C C C C C C C C C
charge: -0.037275 -0.205612 -0.204777 -0.154110 -0.006207 0.476278 0.526915 0.154855 -0.128948 -0.184484 -0.134923 -0.104148 -0.149209 -0.115890 -0.113320 -0.137670 -0.113845 0.317705 0.314666
polarizability: 2.19496579e+02 2.42895920e+01 1.80915978e+02 1.48982983e+01 1.47043082e+01 1.46258312e+02
1716.lowfreq: -4.4943 -0.0008 -0.0006 0.0003 4.2083 8.5139 17.9819 27.6164 35.6456
frequency: 17.9243 27.6051 35.6247 42.0013 50.1128 68.0872 99.0974 124.3128 148.4118 158.3631 203.1768 212.4249 247.9720 319.3262 338.3700 354.4273 380.1303 394.7793 409.4735 412.6740 453.6250 482.7287 518.1409 545.0802 565.2382 620.1973 627.6125 639.1128 688.6159 723.1931 735.2550 761.8050 771.8079 805.2211 818.5879 820.4990 825.9162 830.2653 858.0545 866.2958 946.1275 946.5584 960.9065 961.7930 997.2067 1006.2733 1007.0293 1025.2796 1042.0828 1069.2527 1096.5005 1105.0837 1124.8099 1155.3251 1158.0355 1187.3926 1198.5392 1203.7802 1206.4614 1215.1732 1246.7234 1260.6585 1284.4706 1296.2256 1300.2249 1312.9631 1322.2633 1346.5800 1378.1817 1386.9003 1405.7722 1409.3736 1450.1077 1466.2217 1480.8809 1491.7527 1496.2261 1599.9300 1602.2133 1609.6026 1612.9419 2966.5608 2974.8241 2998.9019 3026.6588 3045.7149 3065.8469 3129.0548 3130.4952 3131.4566 3137.6514 3150.8292 3172.8032 3173.1401 3175.4504 3176.2551
redmass: 5.2491 6.2828 5.4256 5.6682 6.0906 2.4792 3.3526 9.8957 4.1190 6.6428 4.6700 3.6376 5.8248 6.2754 6.2802 5.1452 5.7431 5.0441 2.9482 2.9702 4.3725 4.1926 3.8525 2.7624 4.5814 5.5758 7.1403 5.0268 3.4508 3.3507 2.8961 1.2204 4.2229 4.4174 1.2703 1.2518 1.6006 2.0275 2.6164 1.6649 1.3520 1.3839 1.3608 1.3580 2.1692 2.7860 2.4525 2.7259 2.5429 2.7876 1.2989 1.3322 1.3986 1.4790 1.5199 2.1810 1.9531 2.0539 2.8315 1.2654 1.4304 1.3309 1.2978 1.2290 1.2086 1.3629 1.3877 1.4633 5.3220 5.6414 3.1577 2.6587 1.1033 1.0847 1.1036 2.5963 2.5231 7.5745 7.4239 6.4276 6.3841 1.0649 1.0765 1.0614 1.1009 1.0565 1.1028 1.0901 1.1111 1.0900 1.0892 1.0882 1.0952 1.0955 1.0958 1.0966
irintensity: 0.2779 0.4504 0.1013 0.4339 2.0458 0.8113 0.0170 0.7699 0.3631 0.0468 0.3531 0.2198 1.1915 3.7821 1.8925 5.5435 3.8189 1.5860 0.2994 0.0427 1.2666 2.7379 28.5232 46.2240 18.1459 10.1503 0.9407 11.3038 3.9759 1.6491 10.4489 12.9987 12.6141 16.9934 2.8298 0.6368 39.1570 68.9835 36.7032 6.7412 0.1795 0.0475 0.1251 0.0186 12.9627 17.9188 2.2606 5.2225 1.7741 2.9447 8.5399 1.3461 16.3769 62.2501 32.2409 1.7241 31.3841 28.9207 35.5800 6.0053 4.3403 21.5134 13.9646 5.9456 3.1021 5.5204 23.0111 5.4991 1.0793 0.4630 2.3918 2.2804 2.5856 2.2082 8.5571 151.8229 81.8584 6.3180 6.8853 18.5490 9.7572 13.9167 19.6734 14.8483 21.7732 20.7930 25.4415 9.5221 16.2817 9.2528 7.1089 10.0037 3.4163 5.6010 2.8064 2.0095
temp: 298.150 k
press: 1.00000 atm
elementType: 35 9 9 6 6 6 6 6 6 6 6 6 6 6 6 6 6 6 6 1 1 1 1 1 1 1 1 1 1 1 1 1 1 1
symmnumber: 1
zpe: 692823.3 jmol-1
zpe.correction: 0.263882 hartree
zpe.thermalcorrener: 0.281744 hartree
zpe.thermalcorrenthalpy: 0.282688 hartree
zpe.thermalcorrgfe: 0.213579 hartree
zpe.sumelectzpe: -830.482087 hartree
zpe.sumelectthermal: -830.464226 hartree
zpe.sumelectthermalent: -830.463282 hartree
zpe.sumelectthermalfe: -830.532391 hartree
dipole: -0.6686 -1.5700 0.2335
dipole: 1.7223
quadrupole: -151.5001 -132.7403 -109.7281
quadrupole: -3.0481 -0.5896 6.3755
quadrupole: -20.1772 -1.4175 21.5947 -3.0481 -0.5896 6.3755
hfenergy: -830.7459694 hartree
pointgroup: C01 [X(C16H15Br1F2)]
dipole: 0.5226842 0.4225925 0.0858442 debye
polarizability: 231.2870213|-2.8924462|169.051119|-19.6607824|-6.4067897|146.3327293 unknown
InChI: InChI=1S/C16H15BrF2/c17-11-1-2-16(12-3-7-14(18)8-4-12)13-5-9-15(19)10-6-13/h3-10,16H,1-2,11H2
charge 0 multiplicity 1
34 atoms
Br -4.437694 4.079709 -0.046839
F  5.579229 -0.247287 -0.186113
F  -3.136148 -3.974903 -0.46654
C  -0.04285 0.772547 0.561595
C  -0.610757 1.973836 -0.253402
C  1.460152 0.539019 0.333444
C  -0.851816 -0.509174 0.29934
C  -2.046747 2.359353 0.181697
C  2.175988 -0.256765 1.267912
C  -1.800189 -0.97469 1.244492
C  2.163872 1.062003 -0.780633
C  -0.684421 -1.235873 -0.908768
C  -2.559948 3.551543 -0.628295
C  3.550537 -0.52665 1.107928
C  -2.571779 -2.134172 1.001424
C  3.542223 0.804318 -0.96533
C  -1.445047 -2.393477 -1.176436
C  4.204042 0.01382 -0.013757
C  -2.375119 -2.815814 -0.209982
H  -0.174544 1.026953 1.633814
H  -0.610445 1.723198 -1.333428
H  0.06165 2.845003 -0.11912
H  -2.726722 1.499048 0.047578
H  -2.053858 2.614875 1.258915
H  1.646755 -0.677432 2.131096
H  -1.940407 -0.428581 2.184974
H  1.647192 1.684393 -1.51741
H  0.061744 -0.906547 -1.640601
H  -2.656007 3.327147 -1.70237
H  -1.95865 4.462339 -0.480023
H  4.106452 -1.136406 1.825981
H  -3.305075 -2.501014 1.725349
H  4.092374 1.205948 -1.821311
H  -1.321587 -2.963568 -2.101883
