program: Gaussian 09
title: 000093752
version: EM64L-G09RevD.01
frameworkgroup: C1[X(C16H32O)]
method: RPBEPBE
basis: SDD
operation: Freq
keyword: #pfreq=noraman
keyword: PBEPBE/SDD
title: #p freq=noraman PBEPBE/SDD
converged: YES YES NO NO
title: Mulliken charges:
elementType: O C C C C C C C C C C C C C C C C H H H H H H H H H H H H H H H H H H H H H H H H H H H H H H H H
charge: -0.205775 -0.385783 -0.383963 -0.371160 -0.382030 -0.380143 -0.372971 -0.522561 -0.353393 -0.517972 0.196383 -0.367950 -0.356886 -0.338983 -0.357016 -0.696606 -0.696170 0.195772 0.195839 0.191761 0.191857 0.187768 0.187659 0.192629 0.192694 0.217331 0.217351 0.188962 0.189085 0.232017 0.232034 0.187921 0.187984 0.230529 0.230409 0.213399 0.213186 0.194586 0.194534 0.181952 0.181900 0.197469 0.197441 0.209814 0.214769 0.209768 0.208686 0.217137 0.208732
chargesum: 0.00000
title: Mulliken charges with hydrogens summed into heavy atoms:
elementType: O C C C C C C C C C C C C C C C C
charge: -0.205775 0.005828 -0.000345 0.004267 0.003294 0.054540 0.005076 -0.058510 0.022512 -0.057034 0.196383 0.058635 0.032234 0.024869 0.037894 -0.062255 -0.061614
polarizability: 2.38983275e+02 1.57003534e+00 1.56866344e+02 1.36206623e-02 -5.83368459e-03 1.39301910e+02
1716.lowfreq: -3.5428 -0.0019 0.0013 0.0018 7.2747 17.2543 19.4194 26.2776 35.5348
frequency: 18.6901 19.4197 35.0667 37.7721 48.3834 53.8497 59.9461 69.9760 90.3222 98.7487 103.7069 114.1713 126.2946 131.8073 136.0813 150.5831 157.3527 160.7756 217.6264 223.9320 224.5737 256.0372 279.7758 350.1938 372.5440 402.5619 449.4521 458.3181 464.3362 506.7294 662.3578 694.8477 722.3406 723.2460 727.3226 736.6246 754.1672 781.6205 816.7892 850.1114 850.9773 886.9786 897.5774 901.5526 941.9280 966.3028 968.9156 989.1610 1006.0858 1015.9042 1026.8555 1043.3676 1044.6835 1057.6350 1069.3309 1074.8380 1080.9696 1081.5277 1083.6481 1098.4852 1123.3993 1127.8396 1138.4616 1183.2820 1195.9998 1209.3178 1210.6508 1238.1303 1238.4341 1245.5205 1255.9560 1270.3475 1272.2583 1279.6539 1285.0175 1288.4113 1290.0563 1295.3665 1297.9270 1298.7091 1301.2214 1308.2153 1329.5529 1346.7523 1351.1814 1354.6862 1357.6352 1359.0112 1360.7371 1388.4437 1388.8296 1424.6247 1435.5033 1461.2131 1461.9421 1464.2219 1464.6164 1465.8720 1469.8691 1470.5267 1476.0327 1476.2073 1476.3262 1479.1546 1482.0000 1487.2668 1488.8372 1490.4728 1629.2613 2947.9972 2949.4223 2950.5323 2951.3421 2951.8751 2953.7792 2958.3914 2958.9035 2964.7900 2969.5589 2970.9990 2972.2011 2972.4358 2983.7402 2987.2550 2989.7536 2992.6415 2993.4565 2993.7865 2994.6494 3001.4441 3003.7427 3017.5362 3024.2712 3030.6943 3041.6851 3056.1171 3057.6791 3068.8201 3069.0896 3070.8183 3071.9943
redmass: 3.9649 4.0665 2.1402 2.1609 2.7458 4.0102 2.7844 1.7931 2.1576 3.7809 1.7699 1.7749 2.2450 2.0125 4.4176 1.9751 2.0289 3.6859 3.7533 1.1307 1.1364 4.2994 3.8117 3.6398 3.1865 3.2110 1.9658 3.0847 3.3235 3.0779 4.7302 1.1551 1.0665 1.0698 1.0852 1.1156 1.1608 1.2022 1.2321 1.2806 4.3034 1.9013 1.2558 1.9740 1.2304 4.9059 1.2222 4.2818 4.1067 1.1250 3.7578 1.0565 2.9436 2.8727 2.6579 2.1659 2.2722 2.1900 2.2062 2.1320 2.8731 2.8447 1.7684 1.8541 1.5963 1.2934 1.5042 1.3141 1.3512 1.3654 1.2596 1.2429 1.3421 1.0359 1.0766 1.0450 1.1139 1.1237 1.3552 1.0893 1.1177 1.4750 1.4640 1.5083 1.6251 1.7027 1.6357 1.6985 1.7180 1.2172 1.2179 1.0759 1.1087 1.0729 1.0719 1.0687 1.0666 1.0743 1.0705 1.0792 1.0428 1.0791 1.0425 1.0682 1.0861 1.0929 1.0897 1.0969 7.9754 1.0596 1.0589 1.0585 1.0588 1.0589 1.0592 1.0603 1.0594 1.0589 1.0586 1.0549 1.0366 1.0406 1.0961 1.0974 1.0964 1.0988 1.0996 1.0604 1.0602 1.0974 1.1020 1.1042 1.1028 1.1048 1.1046 1.1032 1.1033 1.1007 1.1009 1.0993 1.0992
irintensity: 0.0224 0.1145 0.0003 0.0272 2.7996 0.0738 0.1310 0.0496 0.3033 1.4557 0.1426 0.0197 0.1536 0.0023 0.0829 0.0005 0.0352 0.9952 2.4557 0.0054 0.0002 2.5529 4.5601 1.3688 0.4207 4.7867 0.7854 1.6099 0.0142 0.1105 4.4551 0.0052 27.9902 0.5375 7.0393 0.2035 0.1197 0.6055 3.2371 1.5775 1.5736 5.7821 2.5857 2.8581 0.0511 22.0720 0.0195 1.5523 4.2625 0.2170 0.3008 0.2126 10.1218 1.0378 0.5284 0.0255 0.4199 0.2750 0.1510 1.0675 0.1532 43.2358 0.0212 0.1159 0.1634 28.0054 0.4252 6.8680 0.0637 28.1590 0.1203 0.0212 11.9004 0.0932 0.0866 0.0032 0.5383 0.1229 2.5364 0.0137 0.0730 33.2193 11.9773 1.0435 20.0836 1.1571 1.1885 9.1808 15.1906 11.3437 10.4476 4.2982 34.8880 0.1715 0.1219 0.2264 0.5093 0.4786 1.0386 1.6551 12.1304 1.5007 12.6308 4.6135 3.9237 1.2609 19.4357 35.6156 83.2490 12.4520 10.3195 2.3437 14.0488 1.8397 0.4022 21.2454 3.3751 62.7467 180.4495 65.7234 39.0465 21.9558 0.6891 1.4662 0.5289 7.7728 0.3863 5.7175 62.9657 12.6086 0.2663 2.8240 13.7595 0.0118 157.7019 1.3107 134.5305 89.8722 126.9979 55.8221 53.2934
temp: 298.150 k
press: 1.00000 atm
elementType: 8 6 6 6 6 6 6 6 6 6 6 6 6 6 6 6 6 1 1 1 1 1 1 1 1 1 1 1 1 1 1 1 1 1 1 1 1 1 1 1 1 1 1 1 1 1 1 1 1
symmnumber: 1
zpe: 1169299.0 jmol-1
zpe.correction: 0.445362 hartree
zpe.thermalcorrener: 0.468570 hartree
zpe.thermalcorrenthalpy: 0.469514 hartree
zpe.thermalcorrgfe: 0.388510 hartree
zpe.sumelectzpe: -702.706569 hartree
zpe.sumelectthermal: -702.683362 hartree
zpe.sumelectthermalent: -702.682417 hartree
zpe.sumelectthermalfe: -702.763422 hartree
dipole: 0.0171 -2.8596 0.0040
dipole: 2.8596
quadrupole: -109.4210 -115.7322 -106.9996
quadrupole: 8.1238 -0.0117 0.0043
quadrupole: 1.2966 -5.0146 3.7180 8.1238 -0.0117 0.0043
hfenergy: -703.1519316 hartree
pointgroup: C01[X(C16H32O1)]
dipole: -0.0096185 -1.124583 -0.0311925 debye
polarizability: 238.9744782|-1.784558|156.8626154|0.0732251|0.4663167|139.3144351 unknown
InChI: InChI=1S/C16H32O/c1-3-5-7-8-9-10-11-13-15-16(17)14-12-6-4-2/h3-15H2,1-2H3
charge 0 multiplicity 1
49 atoms
O  3.038046 1.553306 0.055198
C  -2.118904 0.331932 0.015499
C  -3.411176 -0.514989 -0.00562
C  -0.82835 -0.517925 -0.005114
C  -4.700741 0.336433 0.012065
C  0.45724 0.337866 0.019213
C  -5.994329 -0.508967 -0.00891
C  1.738065 -0.516202 -0.005601
C  -7.283515 0.343097 0.008736
C  4.343443 -0.512947 0.001219
C  3.039637 0.293523 0.020187
C  5.621905 0.344995 0.022363
C  -8.577698 -0.502219 -0.014843
C  6.909841 -0.507421 0.002195
C  8.19856 0.346341 0.024951
C  -9.859928 0.358004 0.004158
C  9.486016 -0.505534 0.003611
H  -2.11716 1.020015 -0.855465
H  -2.117578 0.976709 0.919021
H  -3.411682 -1.161108 -0.908656
H  -3.414106 -1.201663 0.866944
H  -0.832599 -1.207751 0.865373
H  -0.830302 -1.161047 -0.910683
H  -4.697991 1.022961 -0.860396
H  -4.700345 0.982915 0.914631
H  0.465623 0.980878 0.920234
H  0.465519 1.031337 -0.843519
H  -5.995021 -1.155148 -0.91189
H  -5.997435 -1.195641 0.863625
H  1.75297 -1.219771 0.854354
H  1.754608 -1.164996 -0.907692
H  -7.281141 1.030913 -0.862833
H  -7.285222 0.988291 0.912338
H  4.32927 -1.21021 0.866351
H  4.329911 -1.168425 -0.896011
H  5.611426 0.992043 0.920481
H  5.611992 1.034626 -0.843471
H  -8.578804 -1.189962 0.855519
H  -8.57515 -1.145626 -0.918502
H  6.917022 -1.151803 -0.902487
H  6.915337 -1.196099 0.87362
H  8.193381 1.034843 -0.844362
H  8.192203 0.988948 0.928756
H  -9.901719 0.985826 0.914337
H  -10.770645 -0.268611 -0.016451
H  -9.895056 1.034871 -0.870455
H  9.528064 -1.182278 0.878084
H  10.391788 0.127965 0.023108
H  9.531631 -1.132396 -0.907114
