program: Gaussian 09
title: 000093731
version: EM64L-G09RevD.01
frameworkgroup: C1[X(C5H9NO2)]
method: RPBEPBE
basis: SDD
operation: Freq
keyword: #pfreq=noraman
keyword: PBEPBE/SDD
title: #p freq=noraman PBEPBE/SDD
converged: YES YES NO NO
title: Mulliken charges:
elementType: O O N C C C C C H H H H H H H H H
charge: -0.261295 -0.261099 -0.016947 0.075140 -0.461645 -0.509243 -0.502303 -0.093487 0.182992 0.237980 0.264640 0.211879 0.202003 0.248228 0.237390 0.250253 0.195513
chargesum: 0.00000
title: Mulliken charges with hydrogens summed into heavy atoms:
elementType: O O N C C C C C
charge: -0.261295 -0.261099 -0.016947 0.258132 0.040975 0.152867 0.180852 -0.093487
polarizability: 6.98491805e+01 -9.67424062e-01 6.43661472e+01 -5.60305319e+00 2.11601088e+00 5.86102342e+01
1716.lowfreq: -20.2953 -11.3260 -4.2641 -0.0006 0.0004 0.0006 39.6940 77.4367 92.2019
frequency: 39.5285 77.4158 92.1852 127.8487 157.2438 190.9074 250.4386 280.8801 363.9830 369.3112 395.2073 508.1992 690.4113 793.4351 821.2884 947.5185 981.0837 1009.4654 1033.3115 1092.6185 1112.9601 1114.4760 1146.5138 1162.3368 1223.2800 1292.4605 1333.5302 1346.5047 1426.5439 1431.5825 1438.7323 1453.4416 1462.8355 1473.8488 1478.7372 2213.5284 2850.8402 2935.5622 2954.5956 3012.8460 3014.2612 3069.1609 3070.3237 3113.6288 3130.8158
redmass: 3.5546 2.9362 2.7041 1.5615 1.3430 1.9711 3.0421 3.3508 5.6507 2.5800 5.1753 4.8900 5.3884 3.9938 3.1190 4.6585 3.3464 4.1335 3.5099 2.4029 1.2835 1.2805 1.3280 1.7188 1.1853 1.6291 1.1967 1.3024 1.1387 1.1181 1.1044 1.0530 1.0658 1.0508 1.0527 12.4569 1.0824 1.0347 1.0400 1.0606 1.1011 1.0995 1.0930 1.0972 1.1033
irintensity: 3.2682 2.8627 4.1316 0.5613 4.7820 7.9438 5.3660 2.6253 1.5882 3.0708 0.2726 5.3495 12.0312 31.5703 21.9420 14.1346 19.1094 47.2278 157.0321 81.0380 7.5957 1.7639 6.2579 26.6253 28.1553 42.6375 29.6850 5.3353 12.3356 10.2041 11.8364 11.6779 15.0840 9.8410 15.2475 8.7535 91.6400 71.0423 69.9659 12.8591 67.9378 9.7137 32.2776 20.3751 19.5562
temp: 298.150 k
press: 1.00000 atm
elementType: 8 8 7 6 6 6 6 6 1 1 1 1 1 1 1 1 1
symmnumber: 1
zpe: 355803.1 jmol-1
zpe.correction: 0.135518 hartree
zpe.thermalcorrener: 0.145397 hartree
zpe.thermalcorrenthalpy: 0.146342 hartree
zpe.thermalcorrgfe: 0.099693 hartree
zpe.sumelectzpe: -400.428113 hartree
zpe.sumelectthermal: -400.418234 hartree
zpe.sumelectthermalent: -400.417289 hartree
zpe.sumelectthermalfe: -400.463938 hartree
dipole: -4.3150 2.6122 3.8371
dipole: 6.3377
quadrupole: -53.7533 -43.7290 -48.0914
quadrupole: 3.6935 6.5497 0.3064
quadrupole: -5.2287 4.7955 0.4332 3.6935 6.5497 0.3064
hfenergy: -400.5636309 hartree
pointgroup: C01 [X(C5H9N1O2)]
dipole: -1.5433847 -1.3208935 -1.4458488 debye
dipolederiv: -0.5225171 -0.0034857 -0.0024712 0.0326504 -1.1231319 0.0961413 0.0480389 0.3834132 -0.4628005 -0.8826745 0.2741493 0.1447621 0.330738 -0.7463675 -0.0760127 0.2517472 -0.0832539 -0.5058949 -0.3035357 -0.0221567 0.0001246 -0.0245457 -0.2440208 0.0104869 -0.0591668 -0.0131911 -0.2031849 0.9275687 -0.0545004 -0.0267903 -0.3019861 1.254284 -0.0042556 -0.1426988 -0.3823072 0.7018902 -0.1140208 -0.0649795 0.0312991 -0.0406933 0.1015474 0.0000609 0.0197591 0.0204405 0.0522042 0.3487902 -0.0042982 0.0284002 0.025774 0.6894013 0.019572 0.019213 0.1478314 0.2095374 0.6464561 -0.1686435 -0.0649583 -0.0002869 0.2212347 0.0059465 -0.0978055 0.0508999 0.3417678 0.0968441 0.0554638 0.0927675 0.0445653 -0.0025089 0.029615 0.1451758 0.0562764 0.0064129 -0.1191838 -0.0831043 -0.1512383 -0.017904 -0.1045241 -0.1125266 -0.0575446 -0.0200048 -0.1568019 0.0239352 0.0490406 -0.0045105 0.0538913 -0.0200934 -0.1080046 -0.031815 -0.0674883 0.0845923 0.0821257 -0.0441919 -0.0339958 -0.0344762 0.0291112 0.0911878 -0.0442363 0.0575318 0.0140371 -0.1482353 0.0982491 0.0927903 0.0365818 -0.0331384 -0.0149095 0.1044432 -0.1050489 0.0363558 -0.0787873 -0.0671019 -0.1293185 -0.0078605 -0.0231741 -0.0049383 -0.152446 -0.1320178 -0.0373613 0.1071032 -0.0210437 0.0286336 -0.0084191 -0.0127328 0.0802413 0.0331603 0.124944 -0.0394304 0.0433622 0.0475763 0.0282923 0.0907454 -0.1063684 -0.0549731 0.0327949 -0.0404682 0.1068608 0.015935 0.01615 0.0142445 -0.0635999 0.0608853 0.123023 0.0612557 0.0763737 -0.0636378 -0.1231657 -0.0071233 -0.0480312 -0.1151745 0.0595963 -0.0806543 -0.1298753 -0.0739308 -0.0845468 unknown
polarizability: 69.7101596|2.0065001|64.9081336|4.7028484|2.978235|58.2072688 unknown
InChI: InChI=1S/C5H9NO2/c1-7-5(8-2)3-4-6/h5H,3H2,1-2H3
charge 0 multiplicity 1
17 atoms
O  -0.526912 -1.044134 0.562877
O  -1.022615 1.147739 -0.127828
N  2.615651 1.031003 0.744948
C  -0.515061 -0.112674 -0.566645
C  0.912885 0.14796 -1.10251
C  -0.479697 -2.455217 0.171984
C  -2.403334 1.091267 0.380588
C  1.839753 0.639219 -0.070701
H  -1.144912 -0.543152 -1.38901
H  1.318293 -0.786983 -1.532355
H  0.849863 0.892865 -1.916801
H  0.500348 -2.731599 -0.268128
H  -1.286594 -2.706512 -0.549003
H  -0.62573 -3.028089 1.100194
H  -2.670102 2.132152 0.615415
H  -2.457102 0.465072 1.286906
H  -3.092834 0.691781 -0.392633
