program: Gaussian 09
title: 000093732
version: EM64L-G09RevD.01
frameworkgroup: C1[X(C10H18O2)]
method: RPBEPBE
basis: SDD
operation: Freq
keyword: #pfreq=noraman
keyword: PBEPBE/SDD
title: #p freq=noraman PBEPBE/SDD
converged: NO YES NO NO
title: Mulliken charges:
elementType: O O C C C C C C C C C C H H H H H H H H H H H H H H H H H H
charge: -0.418266 -0.233348 -0.367824 -0.340420 -0.469277 -0.356898 -0.149207 -0.693816 -0.396577 -0.234626 -0.483426 0.163630 0.206958 0.189776 0.188882 0.185112 0.203847 0.195799 0.194541 0.196237 0.230099 0.209833 0.209576 0.215933 0.226096 0.227416 0.214039 0.254245 0.254361 0.377306
chargesum: 0.00000
title: Mulliken charges with hydrogens summed into heavy atoms:
elementType: O O C C C C C C C C C C
charge: -0.040959 -0.233348 0.028911 0.033574 -0.069631 0.033879 0.080892 -0.058474 0.056934 -0.020586 0.025180 0.163630
polarizability: 1.57527859e+02 5.50091617e+00 1.05307488e+02 7.72487773e+00 7.04242513e+00 8.73398886e+01
1716.lowfreq: -14.9127 -8.2205 -0.0002 0.0006 0.0008 8.9122 22.4996 26.1031 33.5557
frequency: 20.2088 23.6603 33.4895 45.9400 87.9515 95.8329 111.0907 121.6296 151.5397 188.3118 217.5198 227.5621 287.9350 314.7362 371.7572 438.2868 460.5809 511.7000 557.7606 625.2134 642.1713 717.4089 722.5411 750.1990 808.1119 838.2044 875.4105 888.9302 920.4828 961.7500 980.1356 1001.4180 1028.2631 1029.9396 1046.8467 1064.4184 1076.1718 1104.8912 1112.9248 1142.2322 1161.6667 1195.6420 1227.1872 1237.7912 1250.7264 1269.9441 1278.5996 1279.6832 1286.8774 1303.6808 1304.3219 1322.1569 1341.0025 1349.3098 1380.9619 1386.6303 1444.4706 1458.8790 1461.9353 1462.9858 1470.1995 1476.0662 1479.2367 1487.0126 1663.9601 1688.2684 2947.9218 2951.1176 2961.3669 2968.5287 2970.7126 2974.5575 2989.8826 2993.9242 3004.8827 3010.4697 3020.0260 3040.0862 3047.3298 3067.1944 3070.2404 3073.4484 3083.2402 3505.6455
redmass: 1.9950 8.4397 3.9762 2.3936 2.7670 2.8071 1.9734 2.5469 2.6334 2.9337 2.9332 1.1143 2.9979 3.1851 3.7749 3.7610 2.9130 1.7482 4.6496 3.6862 1.3174 1.3348 1.0845 1.1690 1.4362 1.3876 3.8340 1.9116 2.0648 1.4754 1.0819 3.7748 2.0595 2.2293 2.6897 1.7468 2.2664 2.2914 2.2862 2.2252 1.1904 1.5798 1.2965 1.4411 1.2893 1.1049 1.1252 1.2626 1.1184 1.4138 1.4204 1.4778 1.4820 1.6392 1.8549 1.2149 1.0842 1.0827 1.0924 1.0698 1.0773 1.0432 1.0755 1.0858 7.9568 6.2015 1.0617 1.0588 1.0603 1.0591 1.0369 1.0612 1.0966 1.0603 1.0970 1.0978 1.1022 1.1038 1.0992 1.1007 1.0993 1.0933 1.0863 1.0639
irintensity: 0.0369 0.8503 0.1200 0.0795 0.2987 0.6121 0.2278 0.2242 0.6435 1.2348 2.2509 0.0030 0.3472 2.3993 3.6922 16.0536 6.6437 37.0445 11.7346 15.2734 123.3199 6.2149 12.3383 0.6718 8.4028 1.6897 1.1572 5.6465 23.6100 17.8024 52.2917 5.0753 3.7006 63.8161 84.9265 105.6799 0.7503 13.3677 2.7912 10.0856 0.0531 0.2562 1.9772 3.8993 0.5443 0.1397 1.7750 3.1438 1.1077 23.3825 8.7751 19.2213 4.1514 0.9235 37.4098 11.8151 25.6173 2.4477 29.7937 0.2126 1.7638 12.2759 4.4933 20.5715 206.8534 8.0925 14.4766 14.5483 4.5356 120.3794 34.6375 15.7480 3.6256 11.9709 4.7336 8.9062 1.3458 82.2244 18.4450 92.4606 53.5533 3.1633 76.2059 20.2937
temp: 298.150 k
press: 1.00000 atm
elementType: 8 8 6 6 6 6 6 6 6 6 6 6 1 1 1 1 1 1 1 1 1 1 1 1 1 1 1 1 1 1
symmnumber: 1
zpe: 681601.8 jmol-1
zpe.correction: 0.259608 hartree
zpe.thermalcorrener: 0.274714 hartree
zpe.thermalcorrenthalpy: 0.275658 hartree
zpe.thermalcorrgfe: 0.213846 hartree
zpe.sumelectzpe: -541.330522 hartree
zpe.sumelectthermal: -541.315416 hartree
zpe.sumelectthermalent: -541.314472 hartree
zpe.sumelectthermalfe: -541.376284 hartree
dipole: 1.2499 0.9066 0.5371
dipole: 1.6348
quadrupole: -79.0064 -74.3013 -75.6053
quadrupole: -7.8618 -3.2904 -0.2611
quadrupole: -2.7021 2.0031 0.6991 -7.8618 -3.2904 -0.2611
hfenergy: -541.5901304 hartree
pointgroup: C01 [X(C10H18O2)]
dipole: 0.4927437 -0.3527597 -0.2155397 debye
polarizability: 157.5651283|-5.2828619|105.0965149|-7.7576977|7.2509219|87.5135925 unknown
InChI: InChI=1S/C10H18O2/c1-2-3-4-5-6-7-8-9-10(11)12/h6-7,11H,2-5,8-9H2,1H3
charge 0 multiplicity 1
30 atoms
O  -4.624278 -1.800124 -0.35486
O  -5.043618 0.270582 0.605323
C  2.525416 -0.170301 0.033108
C  4.020663 0.130625 -0.214686
C  1.582047 0.848612 -0.662298
C  4.969193 -0.87714 0.474089
C  0.115573 0.52204 -0.473087
C  6.461116 -0.563713 0.228184
C  -2.269937 1.075231 0.33022
C  -0.79571 1.348951 0.104648
C  -2.751087 -0.300123 -0.160415
C  -4.228774 -0.522989 0.083464
H  2.319081 -0.171069 1.122309
H  2.290821 -1.192661 -0.330578
H  4.253867 1.155254 0.143816
H  4.219009 0.132164 -1.307382
H  1.792529 1.867438 -0.280318
H  1.826791 0.860113 -1.746497
H  4.739519 -1.899819 0.11097
H  4.765011 -0.881861 1.564356
H  -0.195942 -0.471382 -0.832628
H  6.722062 0.441758 0.609529
H  6.696861 -0.582737 -0.852848
H  7.118936 -1.296743 0.730533
H  -2.501532 1.177151 1.410076
H  -2.871904 1.866924 -0.16005
H  -0.44941 2.334132 0.455997
H  -2.563255 -0.428129 -1.24451
H  -2.196804 -1.120952 0.334998
H  -5.598442 -1.913332 -0.178362
