program: Gaussian 09
title: 000093718
version: EM64L-G09RevD.01
frameworkgroup: C1[X(C9H22N2O2)]
method: RPBEPBE
basis: SDD
operation: Freq
keyword: #p
keyword: freq=noraman
keyword: PBEPBE/SDD
title: #p freq=noraman PBEPBE/SDD
converged: YES YES NO NO
title: Mulliken charges:
elementType: O O N N C C C C C C C C C H H H H H H H H H H H H H H H H H H H H H H
charge: -0.456050 -0.437772 -0.124248 -0.080906 -0.384075 -0.400880 -0.324431 -0.360044 -0.378023 -0.316737 -0.320201 -0.625565 -0.615414 0.199843 0.205879 0.203877 0.215717 0.155150 0.236729 0.220916 0.219348 0.184585 0.232943 0.190324 0.199995 0.231706 0.188214 0.181812 0.219552 0.232363 0.182359 0.226201 0.220451 0.346225 0.330158
chargesum: 0.00000
title: Mulliken charges with hydrogens summed into heavy atoms:
elementType: O O N N C C C C C C C C C
charge: -0.109824 -0.107613 -0.124248 -0.080906 0.021647 0.018713 0.067448 0.080220 0.039505 0.073581 0.099719 0.008161 0.013597
polarizability: 1.33677798e+02 -2.47450934e-01 1.19353123e+02 1.52001476e+00 2.86064734e+00 1.10354450e+02
1716.lowfreq: -5.3557 -2.0491 0.0003 0.0004 0.0008 8.6863 26.0760 31.1367 38.4760
frequency: 25.7301 30.6363 38.4488 49.1639 77.4422 87.3510 99.2001 119.3255 148.3161 208.4791 227.8682 236.7814 245.3576 248.3510 265.8145 294.7163 318.1587 330.8561 336.6610 370.2169 406.3619 414.0795 459.7127 488.0345 555.7415 758.8281 794.9830 803.7066 812.8580 836.6524 880.0132 955.5722 968.2198 979.7609 1006.9139 1032.7727 1034.6043 1042.5808 1052.2219 1069.7862 1075.2391 1085.2079 1097.9766 1122.5060 1130.0481 1155.9399 1168.0185 1196.7069 1208.3630 1236.3154 1255.8825 1263.7688 1269.7010 1286.0273 1290.9692 1297.9892 1310.3599 1323.2499 1344.3161 1353.4200 1362.9068 1372.8457 1383.5923 1412.8486 1417.6654 1441.2716 1455.7701 1461.2312 1464.6606 1468.2567 1471.9153 1475.1347 1476.8692 1478.7777 1481.4454 1486.0699 1487.9255 2795.9449 2834.7332 2843.5658 2851.7318 2875.1528 2920.2600 2947.8138 2958.6533 2987.2357 3002.4910 3012.7163 3016.2866 3025.1641 3027.7922 3047.5687 3051.8732 3053.2397 3075.6821 3084.7443 3097.6230 3554.6289 3577.1565
redmass: 4.5553 3.1019 3.2315 3.9519 2.6982 2.4136 2.4230 2.1421 3.1757 2.3652 2.3252 1.5426 1.2451 1.5724 1.0802 1.7760 1.5401 3.2052 2.5097 2.9767 2.4630 2.4865 2.6706 3.1627 3.2258 1.5762 1.1758 2.4699 1.2640 2.1620 2.0401 4.4026 3.2597 3.3184 2.3119 1.6210 2.1786 2.2982 2.0563 1.6872 2.4300 1.4527 1.8522 1.4580 1.4919 1.6429 1.4048 1.5645 1.3005 1.7687 1.7756 1.7571 1.7002 1.1308 1.1822 1.2300 1.4036 1.3182 1.2575 1.3291 1.4294 1.3603 1.3468 1.4426 1.1475 1.1630 1.0794 1.0521 1.0692 1.0684 1.0810 1.0806 1.0623 1.0733 1.0761 1.0828 1.0685 1.0703 1.0578 1.0712 1.0578 1.0705 1.0690 1.0557 1.0693 1.0605 1.1037 1.0891 1.0712 1.0798 1.0772 1.0935 1.0976 1.0914 1.1009 1.1001 1.0964 1.0661 1.0666
irintensity: 0.1093 0.1224 0.5263 0.7366 6.7329 4.6297 5.0299 1.6175 4.1001 1.0401 20.2705 1.0510 1.4859 0.6354 133.5857 26.4828 93.0416 46.0481 11.2581 23.1052 1.4120 5.2356 5.2382 8.2947 3.2628 7.6742 6.6966 25.6704 3.1353 8.1389 1.1830 122.3845 102.6623 24.3514 25.2522 19.2244 30.4033 9.5885 31.2672 0.2398 16.3907 7.2264 17.5842 10.2516 9.1033 19.9396 9.3232 21.4401 32.6780 10.3623 14.0679 0.9986 10.7380 10.5596 3.4484 24.5417 9.0466 12.3346 21.9176 3.4775 6.6653 2.7541 0.8720 0.1063 3.5214 2.3883 4.7780 18.9923 7.3621 1.7200 8.0751 4.9838 11.8284 1.5583 14.5556 6.1340 25.6505 88.5587 75.3519 117.3875 217.2454 102.6533 67.6163 82.0741 60.2274 29.5371 40.4832 15.8667 41.4898 52.2511 16.5435 4.0999 112.6528 22.3449 37.6640 44.7423 31.2388 6.2000 4.4577
temp: 298.150 k
press: 1.00000 atm
elementType: 8 8 7 7 6 6 6 6 6 6 6 6 6 1 1 1 1 1 1 1 1 1 1 1 1 1 1 1 1 1 1 1 1 1 1
symmnumber: 1
zpe: 812417.1 jmol-1
zpe.correction: 0.309433 hartree
zpe.thermalcorrener: 0.326753 hartree
zpe.thermalcorrenthalpy: 0.327697 hartree
zpe.thermalcorrgfe: 0.262391 hartree
zpe.sumelectzpe: -614.919651 hartree
zpe.sumelectthermal: -614.902331 hartree
zpe.sumelectthermalent: -614.901387 hartree
zpe.sumelectthermalfe: -614.966692 hartree
dipole: -0.5811 -2.5059 0.6339
dipole: 2.6493
quadrupole: -81.1661 -89.9008 -79.4322
quadrupole: 5.6421 0.6735 9.2998
quadrupole: 2.3336 -6.4011 4.0675 5.6421 0.6735 9.2998
hfenergy: -615.2290839 hartree
pointgroup: C01 [X(C9H22N2O2)]
dipole: -0.0659845 -1.0393139 0.043431 debye
polarizability: 133.4293355|1.8783815|118.0708535|1.0361429|4.6110974|111.8851823 unknown
InChI: InChI=1S/C9H22N2O2/c1-10(2)4-3-5-11(6-8-12)7-9-13/h12-13H,3-9H2,1-2H3
charge 0 multiplicity 1
35 atoms
O  3.290999 -2.420191 -1.162378
O  1.821909 3.746074 -0.034764
N  1.12065 0.06422 0.599688
N  -3.152924 -0.202077 -0.374919
C  0.200688 -0.625098 1.540102
C  -1.285079 -0.253895 1.326445
C  -1.797463 -0.706429 -0.05455
C  2.326643 -0.720951 0.246127
C  1.383466 1.481864 0.923637
C  2.053229 -1.651265 -0.944756
C  1.529697 2.338341 -0.351886
C  -4.207593 -0.773171 0.486008
C  -3.474793 -0.358046 -1.807681
H  0.317705 -1.715744 1.386324
H  0.482484 -0.42516 2.603155
H  -1.872574 -0.720555 2.141877
H  -1.429861 0.840249 1.41037
H  -1.75128 -1.829729 -0.113248
H  -1.095043 -0.312994 -0.812796
H  2.699693 -1.333048 1.099023
H  3.146579 -0.035422 -0.034945
H  2.29926 1.604525 1.558398
H  0.538469 1.88547 1.508928
H  1.200363 -2.325582 -0.715739
H  1.78913 -1.041379 -1.833611
H  0.574436 2.362041 -0.898894
H  2.30799 1.912639 -1.021275
H  -4.288913 -1.88865 0.400391
H  -5.184767 -0.337471 0.210528
H  -4.016681 -0.524956 1.543814
H  -3.521074 -1.427163 -2.142138
H  -2.711712 0.157305 -2.41791
H  -4.454393 0.106161 -2.022753
H  3.175253 -3.020109 -1.940643
H  2.679807 3.791498 0.459172
