program: Gaussian 09
title: 000093697
version: EM64L-G09RevD.01
frameworkgroup: C1[X(C5H9ClO)]
method: RPBEPBE
basis: SDD
operation: Freq
keyword: #p
keyword: freq=noraman
keyword: PBEPBE/SDD
title: #p freq=noraman PBEPBE/SDD
converged: YES YES NO NO
title: Mulliken charges:
elementType: Cl O C C C C C H H H H H H H H H
charge: -0.113803 -0.090465 -0.079170 -0.362518 -0.674543 -0.691687 -0.036576 0.256078 0.219745 0.204689 0.226414 0.245330 0.226631 0.222337 0.238422 0.209116
chargesum: 0.00000
title: Mulliken charges with hydrogens summed into heavy atoms:
elementType: Cl O C C C C C
charge: -0.113803 -0.090465 0.176908 0.061917 0.023832 -0.021812 -0.036576
polarizability: 8.04446939e+01 8.75081768e-01 6.14703687e+01 -7.68560503e+00 -3.40376956e+00 5.57513552e+01
1716.lowfreq: -8.7811 -2.6809 0.0015 0.0025 0.0031 18.1158 48.4630 99.4354 174.9067
frequency: 48.1995 99.4083 174.9016 197.2426 200.3902 227.3753 282.1750 366.6662 389.1222 413.5244 619.1552 655.6542 786.4605 813.4050 911.4182 969.6144 1011.5982 1022.8951 1092.0904 1110.8687 1163.1969 1252.0426 1261.5071 1322.6360 1334.3407 1386.7439 1397.0418 1459.5863 1471.3214 1478.4877 1483.1081 1487.9528 1749.9040 2983.4950 2990.5961 2994.4060 3017.5059 3046.1193 3079.4684 3088.2910 3094.5679 3108.1253
redmass: 6.1560 1.9746 2.4979 1.4088 1.8563 1.6656 2.2089 3.8821 8.8010 3.1938 5.2909 2.8818 1.6495 1.8535 2.3101 1.2286 2.7103 1.7869 2.0893 1.7725 2.0748 1.2294 1.2910 1.3574 1.4534 1.1871 1.2087 1.0701 1.0500 1.0476 1.0523 1.0487 11.4228 1.0364 1.0568 1.0386 1.0842 1.1002 1.0997 1.1003 1.1007 1.1005
irintensity: 0.0038 0.4954 2.5812 0.2854 0.8904 0.8984 2.6372 33.4222 5.5444 1.3617 19.5651 40.7933 83.8954 19.6264 108.1865 25.7506 3.1077 4.5216 5.0502 2.0212 7.0259 3.5135 5.6564 0.9672 2.1182 8.6620 19.1101 4.6013 22.6458 9.0890 17.8123 13.7790 238.2764 28.5263 9.7390 34.0331 6.0886 5.3263 39.5978 29.7312 33.9184 17.0239
temp: 298.150 k
press: 1.00000 atm
elementType: 17 8 6 6 6 6 6 1 1 1 1 1 1 1 1 1
symmnumber: 1
zpe: 341190.6 jmol-1
zpe.correction: 0.129953 hartree
zpe.thermalcorrener: 0.138768 hartree
zpe.thermalcorrenthalpy: 0.139712 hartree
zpe.thermalcorrgfe: 0.095815 hartree
zpe.sumelectzpe: -730.653907 hartree
zpe.sumelectthermal: -730.645092 hartree
zpe.sumelectthermalent: -730.644148 hartree
zpe.sumelectthermalfe: -730.688044 hartree
dipole: -2.7913 2.2703 -0.9608
dipole: 3.7241
quadrupole: -52.3311 -50.0341 -51.3586
quadrupole: 0.9671 0.6057 2.0220
quadrupole: -1.0898 1.2072 -0.1174 0.9671 0.6057 2.0220
hfenergy: -730.7838599 hartree
pointgroup: C01 [X(C5H9Cl1O1)]
dipole: -1.2891035 0.5609247 -0.4126681 debye
dipolederiv: -0.9181265 0.0255684 0.3927203 0.0187238 -0.1848384 0.0279884 0.4484229 0.0223395 -0.4921284 -0.5218165 0.0820332 0.005731 -0.0806456 -0.3139913 0.3037218 0.3377978 0.2884155 -0.9809579 -0.0851398 0.0805083 -0.0128246 0.0831464 -0.1236189 0.1488011 0.0536442 0.0760684 -0.024128 0.0934213 0.0043699 0.0350929 0.071054 0.0550104 -0.0145361 -0.0711928 0.0184105 0.1284358 -0.0873492 0.0122277 -0.0096267 -0.1040479 0.0745759 -0.0126759 -0.0114727 0.0589117 0.0792257 0.0104447 -0.0460086 0.0095623 -0.0367425 -0.0523631 0.015211 0.0334215 0.0126329 0.078451 1.4956599 -0.245955 -0.3768573 -0.0323824 0.3009783 -0.4115065 -0.7880437 -0.3696722 1.3682545 0.0287096 0.0090786 0.0173593 0.0018615 0.0533894 -0.0763701 0.0228074 -0.0611994 -0.0484772 0.082381 -0.0345934 -0.0369935 -0.0350967 0.0193175 -0.0655996 0.0282513 -0.0801613 -0.112547 -0.0917099 0.0829374 -0.0424197 0.0752927 -0.0392717 0.0638383 -0.055783 0.0754074 0.0395835 -0.0421686 0.0886916 -0.1008296 0.0881848 0.0133373 0.0353986 -0.0899727 0.0331752 0.0505086 -0.0416923 -0.0998305 0.0866966 -0.0532769 0.0626282 0.0013971 0.0817271 0.0360474 0.0631351 0.1078606 0.011871 0.0053404 0.0019644 0.0354111 -0.020606 0.0086346 -0.0999988 -0.1090638 -0.1308707 -0.0919355 0.0953639 -0.0661672 0.0474605 0.0154498 0.1000769 0.0265522 0.0645373 -0.0006184 0.1193985 -0.08542 0.0786047 0.0123814 0.0248363 -0.0753855 0.057534 0.0460945 0.1010147 0.0016384 0.0171048 -0.0104731 0.0395934 -0.0353482 -0.0229333 -0.0944631 -0.1509237 unknown
polarizability: 77.0889858|0.1785666|58.6327139|-10.5205133|-5.5645013|61.9447181 unknown
InChI: InChI=1S/C5H9ClO/c1-3-4(2)5(6)7/h4H,3H2,1-2H3
charge 0 multiplicity 1
16 atoms
Cl 2.455316 -0.103053 -0.890785
O  0.985952 -0.624775 1.366783
C  -0.30676 0.471781 -0.459014
C  -1.637105 0.037358 0.210545
C  -0.129999 2.019854 -0.461508
C  -1.946049 -1.468725 0.074984
C  0.889398 -0.152383 0.243173
H  -0.280398 0.122114 -1.50855
H  -1.614752 0.323122 1.279625
H  -2.445734 0.628365 -0.261852
H  -0.969587 2.474573 -1.015844
H  0.813773 2.316439 -0.9484
H  -0.138714 2.417672 0.56882
H  -2.929393 -1.70569 0.51877
H  -1.190121 -2.083578 0.594671
H  -1.972129 -1.778674 -0.986518
