program: Gaussian 09
title: 000093687
version: EM64L-G09RevD.01
frameworkgroup: C1[X(C5H7NO3)]
method: RPBEPBE
basis: SDD
operation: Freq
keyword: #pfreq=noraman
keyword: PBEPBE/SDD
title: #p freq=noraman PBEPBE/SDD
converged: YES YES NO NO
title: Mulliken charges:
elementType: O O O N C C C C C H H H H H H H
charge: -0.231451 -0.217905 -0.223191 -0.179584 -0.386304 -0.381360 0.215803 0.216874 -0.599706 0.229435 0.273295 0.273640 0.229198 0.257328 0.255304 0.268623
chargesum: 0.00000
title: Mulliken charges with hydrogens summed into heavy atoms:
elementType: O O O N C C C C C
charge: -0.231451 -0.217905 -0.223191 -0.179584 0.116426 0.121478 0.215803 0.216874 0.181550
polarizability: 8.84723336e+01 1.78236893e+00 6.97778096e+01 3.48331287e-01 -1.94722379e+00 4.37273016e+01
1716.lowfreq: -9.4008 0.0003 0.0003 0.0004 4.2871 8.9531 86.9415 93.4478 108.9161
frequency: 86.9103 93.3928 108.9156 213.8889 287.0503 322.1049 357.6290 436.8712 446.3420 535.7355 557.1449 592.1770 626.9184 719.9913 900.8506 925.4811 969.7522 1000.4699 1065.5674 1086.8129 1126.0778 1140.7875 1193.6927 1252.1359 1286.7983 1318.0838 1320.6186 1344.6420 1427.3367 1430.8810 1439.5642 1475.1253 1477.7745 1597.7856 1643.8778 2941.2972 2942.6623 3018.7552 3112.1751 3112.4662 3114.9588 3145.9763
redmass: 1.7858 1.5214 3.3908 5.0164 2.3506 3.5280 6.5253 6.9990 5.7068 4.5581 3.3321 4.0397 6.6163 5.2300 4.7105 2.7134 2.0369 2.7928 5.3449 4.2121 1.3184 2.2922 1.2016 1.1573 3.6436 3.5891 1.4713 1.2997 1.2060 1.0711 1.1027 1.0430 1.0734 11.1379 10.1332 1.0693 1.0691 1.0329 1.0917 1.1021 1.0937 1.1025
irintensity: 1.2538 2.1749 7.6761 6.5416 13.6355 12.5025 33.8415 0.2580 1.7973 17.6887 4.3389 19.8191 6.4435 13.8845 25.1770 18.9626 1.3979 1.0191 5.6924 3.6971 0.2463 155.1600 6.3649 3.6251 220.0816 57.7031 13.6530 3.4974 77.1728 2.2361 6.3347 19.7134 16.2122 474.3697 25.3296 31.3410 37.5216 16.8136 4.4817 14.7581 1.5491 0.5626
temp: 298.150 k
press: 1.00000 atm
elementType: 8 8 8 7 6 6 6 6 6 1 1 1 1 1 1 1
symmnumber: 1
zpe: 318191.6 jmol-1
zpe.correction: 0.121193 hartree
zpe.thermalcorrener: 0.129702 hartree
zpe.thermalcorrenthalpy: 0.130646 hartree
zpe.thermalcorrgfe: 0.087569 hartree
zpe.sumelectzpe: -474.460333 hartree
zpe.sumelectthermal: -474.451824 hartree
zpe.sumelectthermalent: -474.450879 hartree
zpe.sumelectthermalfe: -474.493957 hartree
dipole: 0.1130 -0.8577 1.0749
dipole: 1.3798
quadrupole: -64.3278 -50.5969 -50.8174
quadrupole: -1.9634 0.5627 -3.6447
quadrupole: -9.0804 4.6505 4.4299 -1.9634 0.5627 -3.6447
hfenergy: -474.5815257 hartree
pointgroup: C01 [X(C5H7N1O3)]
dipole: 0.0126295 0.3324794 -0.4289232 debye
dipolederiv: -0.7222888 0.0074971 -0.0113711 -0.0005171 -0.5311056 0.0358744 -0.0098566 0.0032727 -0.3640925 -1.0895173 -0.0325032 -0.0404892 -0.314146 -0.5553685 -0.0073967 -0.0241402 0.0105676 -0.3312248 -1.1209858 0.0479793 -0.0092017 0.3149322 -0.5741229 0.014782 -0.0217915 0.0144383 -0.3340487 -1.6605761 0.0173804 -0.0488666 -0.0170394 -0.6770151 0.053165 -0.0425184 0.0658705 -0.2040274 0.4214071 0.1103432 0.1148859 0.1210215 0.064436 0.0060162 0.1302284 0.0253175 0.3630642 0.433592 -0.126984 -0.1079888 -0.1327385 0.0732497 0.002678 -0.1291064 0.0277259 0.3549669 1.7263864 -0.1324435 0.1074198 -0.212518 0.7506961 -0.0522913 0.0808908 -0.0586161 0.177561 1.775058 0.1327561 -0.0109112 0.2108011 0.7432507 -0.0409226 0.0175652 -0.0522548 0.1704563 0.0206201 -0.0249162 0.0021888 0.0474978 0.311755 -0.017771 -0.0113422 -0.0148646 0.2038916 0.0451504 -0.054111 0.009527 -0.0281096 0.0274067 0.0267021 -0.08904 0.0468872 -0.1369206 -0.0189624 0.0206575 0.0340997 0.0074798 0.0810552 -0.0223535 0.0614692 -0.0526038 0.0858494 -0.014382 -0.0156197 -0.0395886 -0.003287 0.0819894 -0.0204624 -0.0671236 -0.051828 0.0813963 0.0416744 0.051712 0.0001581 0.027144 0.0256415 0.0259438 0.0998192 0.0448731 -0.1321315 0.0770992 -0.06824 -0.0822689 -0.0157229 0.0243559 -0.0095818 -0.057841 -0.0612697 -0.0265292 0.0709744 -0.0510264 0.0977887 -0.007061 0.0339846 0.0036518 0.0655691 0.0493314 -0.0390854 0.0147506 0.1175185 -0.015382 0.0022632 0.1197913 0.0019659 -0.0027818 0.0031526 0.1308744 unknown
polarizability: 88.574641|0.8152365|69.5563908|1.2947444|-2.4294779|43.8464129 unknown
InChI: InChI=1S/C5H7NO3/c1-6-4(7)2-9-3-5(6)8/h2-3H2,1H3
charge 0 multiplicity 1
16 atoms
O  0.007132 1.98692 0.402875
O  -2.333755 -0.739003 -0.178879
O  2.334492 -0.776065 -0.027933
N  -0.009891 -0.784929 0.023149
C  -1.183185 1.418473 -0.226929
C  1.218535 1.391718 -0.156216
C  -1.247396 -0.107261 -0.121088
C  1.252416 -0.135206 -0.040407
C  -0.053337 -2.262063 0.167078
H  -1.24644 1.704763 -1.300832
H  -2.05123 1.839526 0.301388
H  2.064496 1.799591 0.416186
H  1.346865 1.668234 -1.226946
H  -0.57831 -2.707328 -0.693111
H  -0.598752 -2.531423 1.08583
H  0.983361 -2.624547 0.213634
