program: Gaussian 09
title: 000093691
version: EM64L-G09RevD.01
frameworkgroup: C1[X(C10H18O2)]
method: RPBEPBE
basis: SDD
operation: Freq
keyword: #pfreq=noraman
keyword: PBEPBE/SDD
title: #p freq=noraman PBEPBE/SDD
converged: YES YES NO NO
title: Mulliken charges:
elementType: O O C C C C C C C C C C H H H H H H H H H H H H H H H H H H
charge: -0.244823 -0.219721 0.254035 0.044633 -0.448039 -0.423055 -0.720409 -0.735550 -0.727418 -0.389276 -0.496610 0.193023 0.184015 0.236582 0.209501 0.213491 0.195004 0.260758 0.207113 0.196576 0.215869 0.252234 0.206918 0.208893 0.222285 0.209034 0.219889 0.216909 0.247224 0.210916
chargesum: 0.00000
title: Mulliken charges with hydrogens summed into heavy atoms:
elementType: O O C C C C C C C C C C
charge: -0.244823 -0.219721 0.254035 0.228647 -0.001956 -0.014560 -0.055962 -0.060529 -0.087206 0.047522 -0.038470 0.193023
polarizability: 1.27627746e+02 -4.54790802e+00 1.13417572e+02 1.21875862e-01 -1.69617945e+00 9.35021772e+01
1716.lowfreq: -17.6551 -8.9688 -0.0005 -0.0004 0.0004 11.3780 57.5778 78.5065 101.7590
frequency: 57.5319 78.2611 101.7490 150.6964 174.7333 213.5382 232.9090 241.1539 261.9760 281.7442 306.4208 315.5836 336.6437 378.0738 393.7107 421.4421 466.6128 479.1141 513.4819 565.8836 663.2606 730.2474 773.4150 827.3873 834.4699 845.1898 914.3943 924.4996 930.5202 931.2458 946.9645 968.2094 979.0418 1014.3315 1026.8265 1047.7388 1077.7039 1110.5476 1125.7176 1150.8977 1190.6822 1223.0018 1231.5781 1242.1009 1257.7940 1278.2159 1295.6264 1316.2401 1318.7201 1345.6567 1351.0170 1364.5552 1374.7555 1377.3861 1403.6315 1444.3824 1458.2619 1459.3032 1466.4821 1467.5521 1471.9211 1473.7593 1485.1812 1486.7136 1500.3812 1649.4223 2953.6245 2964.3124 2970.0464 2974.7792 2981.9439 2986.3078 2990.8525 2994.1682 3029.2703 3046.0338 3055.2651 3060.7733 3066.1332 3069.4803 3075.6717 3084.7039 3091.4027 3102.1465
redmass: 3.4320 3.0243 3.8946 2.7477 1.4751 1.8045 1.3358 1.8963 1.1598 2.1740 2.4072 3.8391 2.2397 2.5200 2.8748 2.7436 1.8115 2.7371 2.4714 4.1090 3.6012 3.6255 2.9805 2.4088 2.0802 2.0699 2.5448 2.1234 1.5606 1.7035 1.2238 2.2280 2.9219 1.6091 1.4611 1.8990 1.8996 2.3684 2.0483 1.4351 1.6848 2.2866 1.7134 1.5101 2.1571 1.4186 1.3563 1.3656 1.3170 1.4373 1.4890 1.4152 1.2080 1.2037 1.2078 1.0789 1.0904 1.0520 1.0524 1.0832 1.0813 1.0502 1.0560 1.0546 1.0631 10.6308 1.0831 1.0636 1.0362 1.0371 1.0367 1.0631 1.0650 1.0615 1.0949 1.1023 1.1018 1.0986 1.0982 1.0988 1.0980 1.0964 1.0999 1.0983
irintensity: 1.3913 1.0142 0.6019 1.3892 1.7027 2.8373 0.1553 0.0574 0.0182 0.2063 1.2242 1.4505 0.4405 1.1850 0.2790 0.6535 1.9219 0.6884 0.6608 11.5850 5.2000 2.7491 1.0590 0.4270 8.1762 9.7253 56.6838 5.9574 2.6309 0.9768 0.7144 19.8568 62.4638 15.2883 0.9589 10.7070 86.0630 37.9289 78.9530 64.4811 18.7806 3.1921 47.2093 2.7504 33.5001 15.5053 2.7006 12.1416 0.9303 1.4595 5.5597 1.1204 25.8939 21.5092 19.8306 5.9987 22.6549 1.6278 4.0942 12.2539 10.3005 1.3561 7.7629 13.2714 28.7657 286.8782 20.2893 33.2542 27.1321 46.7608 15.8338 19.1841 22.9346 26.7246 50.2251 27.0804 44.9189 4.2713 64.6400 18.2419 80.4508 17.3248 15.7874 25.2031
temp: 298.150 k
press: 1.00000 atm
elementType: 8 8 6 6 6 6 6 6 6 6 6 6 1 1 1 1 1 1 1 1 1 1 1 1 1 1 1 1 1 1
symmnumber: 1
zpe: 689199.2 jmol-1
zpe.correction: 0.262502 hartree
zpe.thermalcorrener: 0.275645 hartree
zpe.thermalcorrenthalpy: 0.276589 hartree
zpe.thermalcorrgfe: 0.224004 hartree
zpe.sumelectzpe: -541.342328 hartree
zpe.sumelectthermal: -541.329186 hartree
zpe.sumelectthermalent: -541.328242 hartree
zpe.sumelectthermalfe: -541.380826 hartree
dipole: -1.1073 4.7057 -1.6856
dipole: 5.1197
quadrupole: -73.3055 -83.8277 -73.4597
quadrupole: 8.2011 -2.7523 3.1821
quadrupole: 3.5588 -6.9634 3.4045 8.2011 -2.7523 3.1821
hfenergy: -541.6048304 hartree
pointgroup: C01 [X(C10H18O2)]
dipole: -0.5192706 -1.8172163 0.6966348 debye
polarizability: 127.9990814|3.915868|112.9740957|-0.1136659|-2.0538936|93.5743176 unknown
InChI: InChI=1S/C10H18O2/c1-10(2,3)8-6-4-5-7-9(11)12-8/h8H,4-7H2,1-3H3
charge 0 multiplicity 1
30 atoms
O  0.255451 0.95032 -0.281334
O  2.168071 2.161183 -0.468642
C  -2.012744 0.132797 0.050149
C  -0.506311 -0.252546 0.198977
C  -0.041752 -1.502801 -0.579217
C  1.222637 -2.172472 0.008043
C  -2.272899 1.445819 0.838031
C  -2.385467 0.340888 -1.440688
C  -2.886445 -0.99408 0.667152
C  2.497568 -1.298674 -0.02112
C  2.370546 0.045999 0.7510
C  1.621983 1.127958 -0.027349
H  -0.295236 -0.381273 1.28335
H  0.130279 -1.213039 -1.633474
H  -0.858201 -2.248207 -0.582977
H  1.42488 -3.108726 -0.548167
H  1.015882 -2.470501 1.057473
H  -1.664259 2.272967 0.437736
H  -3.340049 1.725868 0.7653
H  -2.027444 1.324373 1.911183
H  -2.269418 -0.58983 -2.026108
H  -1.749539 1.120345 -1.894634
H  -3.440819 0.659402 -1.52605
H  -2.595227 -1.206522 1.714267
H  -3.945593 -0.678086 0.672712
H  -2.827171 -1.936909 0.093844
H  2.792968 -1.090123 -1.068024
H  3.328723 -1.872393 0.431837
H  3.371669 0.461271 0.951914
H  1.881017 -0.13741 1.728116
