program: Gaussian 09
title: 000093686
version: EM64L-G09RevD.01
frameworkgroup: C1[X(C16H26O)]
method: RPBEPBE
basis: SDD
operation: Freq
keyword: #pfreq=noraman
keyword: PBEPBE/SDD
title: #p freq=noraman PBEPBE/SDD
converged: YES YES NO NO
title: Mulliken charges:
elementType: O C C C C C C C C C C C C C C C C H H H H H H H H H H H H H H H H H H H H H H H H H H
charge: -0.204298 0.258746 -0.104982 -0.582077 -0.493698 0.540099 -0.780765 -0.425923 -0.772396 0.172728 -0.601511 -0.804103 -0.463039 -0.272124 0.405591 -0.794320 -0.817774 0.207276 0.207820 0.223433 0.243502 0.205468 0.230739 0.208523 0.233229 0.207131 0.246937 0.212292 0.219783 0.199537 0.212744 0.237837 0.242805 0.251888 0.204407 0.204682 0.200604 0.201628 0.221269 0.249586 0.215473 0.229642 0.221613
chargesum: 0.00000
title: Mulliken charges with hydrogens summed into heavy atoms:
elementType: O C C C C C C C C C C C C C C C C
charge: -0.204298 0.258746 0.102293 -0.150824 -0.044728 0.540099 -0.108273 -0.218792 -0.093385 0.172728 -0.189230 -0.071573 -0.053950 -0.071520 0.405591 -0.121837 -0.151047
polarizability: 1.72906150e+02 -2.27245531e+00 1.75548651e+02 -1.66885233e+00 1.06534242e+00 1.55499142e+02
1716.lowfreq: -19.0148 -7.5975 -0.0010 -0.0010 -0.0006 10.1989 23.9381 37.8218 62.8003
frequency: 22.3964 37.6188 62.6927 65.8192 74.9445 117.6368 131.5378 146.5495 150.2388 165.3238 173.2210 199.4081 202.1316 223.8004 232.0096 284.4557 290.4870 308.1445 321.7973 337.8284 353.7458 359.6454 384.7230 394.0243 407.2272 450.6212 465.9975 497.1276 519.3772 549.8362 584.0974 592.5043 637.3062 681.6119 755.6807 773.0360 812.9476 828.9957 851.5781 871.0885 890.0238 910.9108 925.0053 942.6815 945.5810 951.2891 967.6640 985.0005 994.9175 997.9289 1022.5452 1027.7389 1057.6431 1068.8026 1074.4980 1084.7748 1104.6542 1106.3756 1114.4511 1145.6132 1158.3139 1179.5947 1190.3011 1219.3376 1232.9725 1247.1339 1255.8776 1277.9801 1295.1092 1319.5720 1325.2804 1330.6594 1346.7384 1357.8309 1366.8397 1374.6022 1382.7390 1385.2421 1392.3929 1394.2571 1445.1629 1446.3696 1455.7950 1457.3971 1458.8284 1462.7260 1464.5895 1468.4258 1470.7021 1475.2039 1477.7354 1479.8387 1485.4235 1495.0547 1612.1326 1695.5396 1699.2650 2945.9050 2949.2573 2955.8087 2958.2778 2959.9778 2967.5513 2977.8634 2979.1783 2983.6923 2989.5137 2990.9335 3016.2640 3019.2927 3026.0697 3033.7989 3038.8584 3066.2762 3068.2395 3072.2099 3077.0245 3077.5368 3082.4851 3082.6026 3086.7551 3096.4811 3116.4389
redmass: 3.8778 3.6232 2.9113 3.6942 5.3997 1.2091 2.4353 2.4860 2.1648 1.0361 2.1233 1.3005 1.3329 1.4230 2.3416 2.2412 2.3033 1.9504 2.4250 2.7152 2.1307 2.8041 3.3162 2.2405 2.3856 2.3695 2.9699 2.4977 2.9616 2.8136 3.7042 2.7227 3.1084 3.3533 2.1146 2.3694 1.4528 1.4748 2.1083 2.4225 1.8239 2.1157 1.8571 1.7951 1.6883 1.4059 1.7614 2.1979 1.5795 1.4647 1.6964 1.6015 1.7567 3.1637 1.7803 1.6639 1.4400 1.9962 1.9643 1.9026 2.1784 1.7224 1.2467 1.7339 2.0216 1.8751 1.5178 1.7695 1.3635 1.4168 1.4140 1.3946 1.5734 1.4593 1.2494 1.7799 1.2065 1.3147 1.2034 1.2268 1.0938 1.0680 1.0594 1.0610 1.0781 1.0821 1.0768 1.0672 1.0577 1.0531 1.0582 1.0705 1.0560 1.0516 8.3830 7.0307 6.6236 1.0611 1.0617 1.0371 1.0649 1.0379 1.0650 1.0712 1.0353 1.0458 1.0429 1.0930 1.0975 1.0931 1.0967 1.0972 1.0947 1.0917 1.0983 1.0995 1.0953 1.0964 1.0970 1.0977 1.0990 1.0907 1.1011
irintensity: 0.7512 0.2922 0.1097 0.4091 6.6193 0.3715 0.1613 2.8320 0.2927 0.2420 0.7115 0.2512 0.1572 0.0183 0.1405 0.6618 0.2238 2.7571 1.8610 1.5774 2.6500 2.6892 1.3726 0.0728 2.1575 7.6996 2.0208 1.4387 7.1050 3.3654 1.2150 1.6419 3.4752 0.4223 15.4072 4.4476 2.5138 25.8893 4.4688 1.5538 2.5028 2.1320 0.1641 2.6811 15.9268 0.4252 0.8334 3.0403 0.4774 6.1943 6.9083 3.2461 10.5572 0.6032 7.8343 6.8720 5.6974 8.9752 6.9330 1.9439 33.3477 1.3600 6.5170 7.8480 5.8973 12.0701 1.5474 6.8490 0.2050 2.5650 0.7414 1.3912 2.5461 1.7977 51.1636 7.3875 16.6065 30.5499 16.1867 14.9972 22.7600 13.2684 1.9237 13.1173 16.9471 2.9398 13.9908 8.2121 18.1537 26.9788 22.9362 7.4190 6.8424 0.9968 101.6828 1.3832 3.4364 31.9661 20.1316 29.1280 51.1926 55.8444 86.3282 34.7011 25.3618 35.5405 16.8700 35.0800 12.0772 5.9423 26.8017 38.2905 31.9112 12.8920 32.5164 18.7343 15.7481 46.2789 29.7657 59.9111 22.5339 33.3522 13.5981
temp: 298.150 k
press: 1.00000 atm
elementType: 8 6 6 6 6 6 6 6 6 6 6 6 6 6 6 6 6 1 1 1 1 1 1 1 1 1 1 1 1 1 1 1 1 1 1 1 1 1 1 1 1 1 1
symmnumber: 1
zpe: 991934.9 jmol-1
zpe.correction: 0.377808 hartree
zpe.thermalcorrener: 0.397759 hartree
zpe.thermalcorrenthalpy: 0.398703 hartree
zpe.thermalcorrgfe: 0.329892 hartree
zpe.sumelectzpe: -699.151252 hartree
zpe.sumelectthermal: -699.131301 hartree
zpe.sumelectthermalent: -699.130357 hartree
zpe.sumelectthermalfe: -699.199169 hartree
dipole: -2.0450 0.6081 -2.0866
dipole: 2.9843
quadrupole: -103.9656 -106.7564 -103.5866
quadrupole: 2.5383 0.4157 4.2359
quadrupole: 0.8040 -1.9869 1.1829 2.5383 0.4157 4.2359
hfenergy: -699.52906 hartree
pointgroup: C01 [X(C16H26O1)]
dipole: 0.807405 -0.2623984 -0.8110178 debye
polarizability: 172.7369493|-2.1791663|175.6741847|1.8490057|-1.1496699|155.5428094 unknown
InChI: InChI=1S/C16H26O/c1-12(2)7-6-8-15-9-10-16(5,14(4)17)13(3)11-15/h7,9,13H,6,8,10-11H2,1-5H3
charge 0 multiplicity 1
43 atoms
O  0.354732 2.106058 0.88931
C  2.083899 0.450958 0.282675
C  2.022693 -0.549509 -0.928891
C  0.571902 -1.080371 -1.096125
C  1.650733 -0.272263 1.587259
C  -0.035224 -1.59198 0.204702
C  3.514629 1.04577 0.468839
C  0.475474 -1.212668 1.406648
C  3.016283 -1.72838 -0.7860
C  1.151803 1.672438 0.014603
C  -1.259798 -2.48477 0.092692
C  1.254435 2.384805 -1.336437
C  -2.500937 -1.768458 -0.542152
C  -2.940216 -0.574149 0.278872
C  -3.038013 0.732008 -0.100911
C  -3.382664 1.813172 0.910572
C  -2.780137 1.251022 -1.505295
H  2.299648 0.004889 -1.849371
H  0.564813 -1.890457 -1.854896
H  -0.082622 -0.2819 -1.506488
H  1.384066 0.491953 2.342749
H  2.517437 -0.831117 1.999814
H  4.219181 0.254837 0.779288
H  3.904096 1.498481 -0.461428
H  3.515722 1.820606 1.257698
H  0.00875 -1.58905 2.328336
H  2.777118 -2.348971 0.095511
H  2.956109 -2.379583 -1.678178
H  4.062237 -1.385125 -0.698897
H  -1.026036 -3.37785 -0.525884
H  -1.543053 -2.852892 1.098252
H  2.298557 2.487783 -1.677982
H  0.712204 1.808944 -2.110352
H  0.787877 3.379574 -1.257197
H  -2.270846 -1.479462 -1.584252
H  -3.321768 -2.513837 -0.600563
H  -3.149774 -0.805779 1.33595
H  -4.224069 2.445279 0.56301
H  -3.653049 1.384458 1.891305
H  -2.509688 2.479638 1.060336
H  -2.496464 0.459678 -2.219408
H  -1.976144 2.014333 -1.489276
H  -3.683496 1.754785 -1.903838
