program: Gaussian 09
title: 000093739
version: EM64L-G09RevD.01
frameworkgroup: C1[X(C20H28N2O3)]
method: RPBEPBE
basis: SDD
operation: Freq
keyword: #p
keyword: freq=noraman
keyword: PBEPBE/SDD
title: #p freq=noraman PBEPBE/SDD
converged: YES YES NO NO
title: Mulliken charges:
elementType: O O O N N C C C C C C C C C C C C C C C C C C C C H H H H H H H H H H H H H H H H H H H H H H H H H H H H
charge: -0.283380 -0.191125 -0.256865 -0.248663 -0.106208 -0.174532 -0.466570 -0.535134 0.216547 0.177530 -0.428769 -0.390470 -0.353532 -0.340175 0.151955 -0.333428 -0.340703 0.315127 -0.694444 -0.695845 -0.361550 -0.309684 -0.230409 -0.240841 -0.222879 0.286429 0.238877 0.241202 0.274982 0.256634 0.220835 0.216527 0.255747 0.205606 0.260542 0.191967 0.224643 0.181390 0.188533 0.192634 0.190955 0.205700 0.210899 0.214505 0.226428 0.215724 0.208785 0.218908 0.257124 0.269354 0.228906 0.230909 0.229302
chargesum: 0.00000
title: Mulliken charges with hydrogens summed into heavy atoms:
elementType: O O O N N C C C C C C C C C C C C C C C C C C C C
charge: -0.283380 -0.191125 -0.256865 -0.248663 -0.106208 0.111897 0.013509 -0.003518 0.216547 0.177530 0.008594 0.070883 0.098978 0.065857 0.151955 0.047739 0.055952 0.315127 -0.042613 -0.052428 -0.104427 -0.040331 -0.001503 -0.009932 0.006423
polarizability: 2.81577835e+02 6.16178711e+00 2.39997614e+02 2.70512991e+01 2.02350377e-01 1.94820018e+02
1716.lowfreq: -8.5606 -1.8738 -0.0007 0.0001 0.0004 8.6347 15.7597 22.0249 26.6954
frequency: 15.3883 21.8476 26.5813 33.2614 37.4366 51.9920 59.3133 66.2186 72.7472 83.3192 92.1611 103.6089 116.8775 125.4352 142.2974 154.8826 186.1331 191.9954 213.5220 225.4782 227.5227 237.7089 245.4146 280.5910 313.8480 326.6862 342.0427 386.9874 391.9923 399.9099 402.3520 404.2260 443.1001 503.4734 520.4488 550.5742 594.5342 609.2093 613.0703 647.1950 668.6403 695.3500 707.5940 719.0995 737.0466 737.1255 741.1964 785.8729 791.9797 793.2672 823.5037 841.3586 853.6772 887.2292 900.4935 901.7655 920.3302 924.6253 939.3648 951.8385 972.0056 981.3300 990.4616 999.8149 1008.5194 1016.2714 1025.2406 1029.7145 1046.6567 1062.9002 1068.3009 1070.5958 1088.3623 1094.6751 1110.7019 1114.1381 1142.4698 1147.9996 1160.5584 1174.0488 1182.0304 1192.7288 1197.2749 1207.5163 1219.4760 1242.5200 1263.9771 1266.0202 1270.7651 1276.5756 1288.2839 1289.0996 1298.0622 1298.1506 1300.0694 1321.1098 1323.4312 1334.8314 1344.3782 1345.3120 1362.5326 1366.7752 1386.2836 1391.9137 1392.9672 1418.6116 1436.1201 1440.0037 1450.1748 1468.9332 1471.7815 1474.2013 1475.9056 1476.1247 1477.3759 1479.8043 1480.8981 1488.1772 1488.8172 1499.3506 1551.7160 1583.4745 1592.1132 1610.9624 1666.0297 2959.4903 2964.3342 2970.7679 2974.2928 2976.7263 2979.3433 2993.1835 2996.9004 3003.9478 3010.9591 3018.9838 3022.9953 3032.3562 3039.0407 3056.8253 3069.7568 3072.9442 3074.2163 3077.8420 3079.1765 3085.8141 3098.0934 3105.7653 3128.5579 3141.0253 3152.2030 3162.6821 3171.8698
redmass: 4.8899 5.0248 3.9186 4.1190 4.5014 4.2568 5.2153 2.2961 2.3744 1.5907 7.0116 4.8692 2.6294 2.4629 3.0189 3.1006 4.7409 3.6649 2.9239 1.1295 1.1932 3.3456 3.9155 3.6200 3.4361 6.1250 6.5463 4.2393 3.3189 3.3552 4.4322 2.9674 3.0870 4.5078 3.0792 3.7762 6.2130 3.5856 6.4286 5.5583 5.7821 2.4482 2.4229 4.4466 1.5005 1.0926 1.9316 1.2258 2.1506 1.3173 4.0552 2.1228 1.2461 3.7072 1.8893 1.7222 1.5796 1.2467 1.4514 2.1936 2.3472 1.3942 6.1649 1.3367 3.8410 3.2093 2.8001 2.5110 1.8699 3.4612 2.4746 2.5441 1.6408 1.7172 2.2859 2.3949 1.4334 1.7430 3.2758 1.0586 1.8417 1.1451 2.2885 1.6814 1.6392 1.6891 1.4180 1.2795 1.4027 1.3050 2.5528 1.3428 1.2545 1.5118 1.1670 1.4363 1.3187 1.3824 1.3909 1.4631 1.4531 1.3809 9.1149 1.2165 1.2122 2.8172 2.2702 1.0907 1.1057 1.0724 1.0630 1.0937 1.0443 1.0612 1.0461 2.2164 1.0844 1.0814 1.0908 1.1046 10.9459 5.8687 6.3845 5.9662 12.2949 1.0589 1.0594 1.0612 1.0383 1.0380 1.0595 1.0639 1.0647 1.0969 1.0961 1.0616 1.0643 1.1004 1.0993 1.1047 1.1008 1.1001 1.0993 1.1003 1.1024 1.1017 1.0867 1.1007 1.0852 1.0885 1.0930 1.0968 1.1010
irintensity: 0.5978 1.0017 0.1154 0.9083 3.2615 1.0432 2.2418 0.3957 0.6724 0.4048 3.7498 0.7693 0.5142 0.4407 2.5558 0.9068 3.1019 6.1811 0.3038 0.1393 0.9624 2.0164 3.6156 4.6480 2.8317 1.0433 3.7283 1.4023 10.2139 6.3358 3.3709 1.1547 8.6131 4.8114 6.4412 1.5286 15.2916 3.8211 0.4046 25.3729 14.6549 16.0391 72.2060 3.2468 7.4562 5.3881 16.3072 3.4986 22.2292 7.7430 28.6761 16.4120 1.5572 11.0630 5.0532 12.5161 6.1174 2.8633 3.6202 5.1671 8.0354 0.6113 0.4229 0.8521 5.0204 3.6821 4.5490 9.0027 1.6202 9.2210 0.3771 0.9511 13.7769 15.2290 14.5960 14.1564 23.9418 58.0991 7.9322 0.3638 149.6599 8.0110 18.2495 77.0563 27.5080 18.5280 20.2638 1.8512 15.7922 14.2517 328.9888 108.6065 27.6715 32.7025 13.6135 12.1478 7.5365 2.2327 20.8092 12.3552 15.8092 7.7561 3.9291 11.0543 8.1980 75.7924 17.7695 22.8447 14.6870 0.7846 0.6194 8.5120 13.7716 6.2939 9.8448 11.9897 5.8613 10.0983 13.6627 14.6116 161.5299 254.8852 41.0127 18.5600 324.1077 35.2406 11.3729 32.1899 45.4141 28.4065 10.4539 59.7074 29.8383 20.3741 7.0613 27.0827 5.5973 2.0901 19.7734 32.2724 44.0464 69.9066 51.4894 48.4528 52.2082 16.6377 8.1038 18.1625 0.3984 7.5044 19.9485 21.5185 15.5245
temp: 298.150 k
press: 1.00000 atm
elementType: 8 8 8 7 7 6 6 6 6 6 6 6 6 6 6 6 6 6 6 6 6 6 6 6 6 1 1 1 1 1 1 1 1 1 1 1 1 1 1 1 1 1 1 1 1 1 1 1 1 1 1 1 1
symmnumber: 1
zpe: 1171743.8 jmol-1
zpe.correction: 0.446294 hartree
zpe.thermalcorrener: 0.472641 hartree
zpe.thermalcorrenthalpy: 0.473586 hartree
zpe.thermalcorrgfe: 0.385777 hartree
zpe.sumelectzpe: -1112.240496 hartree
zpe.sumelectthermal: -1112.214148 hartree
zpe.sumelectthermalent: -1112.213204 hartree
zpe.sumelectthermalfe: -1112.301012 hartree
dipole: 4.5731 1.4351 0.8110
dipole: 4.8612
quadrupole: -139.9603 -152.4427 -142.7792
quadrupole: -1.8593 10.4472 2.9046
quadrupole: 5.1004 -7.3819 2.2815 -1.8593 10.4472 2.9046
hfenergy: -1112.6867893 hartree
pointgroup: C01 [X(C20H28N2O3)]
dipole: 1.8254468 -0.5045508 -0.2663354 debye
polarizability: 283.2623657|-5.0055889|239.5816614|-24.7543165|-1.5115605|193.5514397 unknown
InChI: InChI=1S/C20H28N2O3/c1-3-5-14-21(15-6-4-2)20(25)17-12-13-18(23)22(17)19(24)16-10-8-7-9-11-16/h7-11,17H,3-6,12-15H2,1-2H3
charge 0 multiplicity 1
53 atoms
O  0.780115 1.66186 0.210053
O  -2.830659 1.649169 -2.006087
O  -1.212503 -1.869917 -0.205331
N  -1.085875 0.194856 -1.250841
N  2.352928 -0.045294 0.009564
C  0.36013 -0.0057 -1.528861
C  0.598939 0.812944 -2.835916
C  -0.478423 1.917544 -2.777858
C  1.179959 0.587889 -0.351298
C  -1.632092 1.290527 -1.989283
C  2.844225 -1.319366 -0.574075
C  3.151975 0.542593 1.114785
C  2.27093 -2.575964 0.123784
C  4.256485 1.498732 0.610503
C  -1.742398 -0.730669 -0.39137
C  2.843201 -3.883381 -0.469496
C  5.108521 2.065636 1.768913
C  -2.99001 -0.322925 0.31689
C  2.274765 -5.140094 0.224452
C  6.215034 3.023671 1.277956
C  -3.96399 -1.31904 0.584673
C  -3.154962 0.98617 0.837945
C  -5.113808 -0.999807 1.334771
C  -4.294274 1.294631 1.608687
C  -5.280246 0.308474 1.848932
H  0.543977 -1.080528 -1.660324
H  1.625238 1.211614 -2.887268
H  0.43573 0.161046 -3.712608
H  -0.125103 2.795456 -2.206557
H  -0.834656 2.260683 -3.761444
H  2.627258 -1.350924 -1.657531
H  3.94785 -1.315056 -0.485403
H  2.459366 1.094494 1.773269
H  3.59877 -0.288095 1.694922
H  1.167048 -2.574172 0.040775
H  2.504989 -2.526056 1.206389
H  3.778519 2.330283 0.057838
H  4.916044 0.967689 -0.106925
H  3.949899 -3.880248 -0.384615
H  2.612971 -3.92659 -1.554159
H  5.567629 1.228232 2.333879
H  4.446227 2.597638 2.481256
H  2.519097 -5.141332 1.303293
H  2.685533 -6.066467 -0.217052
H  1.173803 -5.176138 0.131235
H  5.780775 3.883977 0.735073
H  6.91039 2.50808 0.589004
H  6.808122 3.421268 2.12166
H  -3.80328 -2.332719 0.203033
H  -2.387484 1.745669 0.660381
H  -5.873499 -1.765684 1.524928
H  -4.415111 2.302838 2.018896
H  -6.170372 0.556404 2.438359
