program: Gaussian 09
title: 000093640
version: EM64L-G09RevD.01
frameworkgroup: C1[X(C13H20O)]
method: RPBEPBE
basis: SDD
operation: Freq
keyword: #pfreq=noraman
keyword: PBEPBE/SDD
title: #p freq=noraman PBEPBE/SDD
converged: YES YES NO NO
title: Mulliken charges:
elementType: O C C C C C C C C C C C C C H H H H H H H H H H H H H H H H H H H H
charge: -0.239119 -0.214549 0.252591 -0.094928 -0.471332 -0.213433 -0.729377 -0.757255 -0.224200 -0.763502 0.134828 -0.292536 -0.108976 -0.748000 0.201531 0.243905 0.214299 0.207695 0.210322 0.232852 0.207208 0.230874 0.214865 0.237354 0.213715 0.197064 0.210173 0.200229 0.253757 0.235642 0.258193 0.230371 0.235000 0.234737
chargesum: 0.00000
title: Mulliken charges with hydrogens summed into heavy atoms:
elementType: O C C C C C C C C C C C C C
charge: -0.239119 -0.013018 0.252591 0.148978 -0.049337 -0.003110 -0.058443 -0.091320 -0.027136 -0.099343 0.134828 -0.056894 0.149217 -0.047892
polarizability: 1.84034178e+02 5.47927272e+00 1.33466574e+02 -2.26977153e+00 6.53086437e-01 1.13603927e+02
1716.lowfreq: -0.0007 -0.0007 -0.0002 3.2115 8.4262 13.6280 34.7640 57.0855 90.9744
frequency: 34.2833 56.9491 90.8838 97.1037 128.4241 169.3014 193.9178 198.9706 209.3137 222.8612 232.0746 241.8380 251.7644 276.3926 304.6569 323.7936 353.4361 392.8218 395.1140 441.0989 447.8654 487.4774 503.2507 642.5310 677.1132 722.9503 756.6069 785.7571 834.4984 849.8125 885.8159 891.3530 911.5652 927.1956 934.8383 958.1424 975.7387 986.5681 992.2831 1002.7283 1009.3608 1054.1094 1061.3649 1072.8021 1101.5553 1124.4498 1134.5379 1143.8506 1175.8818 1198.0254 1204.6551 1251.9627 1272.7926 1274.5867 1289.4772 1297.8690 1313.6908 1338.4847 1344.8054 1372.0805 1378.5864 1383.7573 1393.1036 1400.9786 1453.2752 1456.5112 1459.7911 1462.7688 1465.2604 1471.3866 1480.0409 1483.0747 1489.9129 1560.5655 1657.1838 1677.5500 2939.1120 2961.1854 2966.7611 2968.2828 2969.7329 2983.0193 2990.4018 3014.6737 3038.3305 3056.5469 3064.2898 3070.9401 3072.3268 3075.3774 3080.5354 3091.8637 3097.0559 3101.7323 3112.7325 3116.7822
redmass: 3.8568 3.0477 2.1219 1.9241 3.3990 1.9991 2.3470 1.2641 1.5638 2.4686 2.7255 1.6810 1.8144 1.1154 2.5418 3.4803 2.9191 3.3762 2.4147 2.5049 3.7690 3.3598 2.4645 3.9087 5.1722 1.4319 2.6297 3.1019 2.3050 2.0717 1.9953 1.9527 1.7089 1.5341 1.7463 2.5500 1.2483 2.3910 1.0870 1.4198 1.5588 1.5980 1.7942 2.2066 1.9515 2.0278 2.0153 1.8602 2.1912 1.5046 1.9547 1.6730 1.4983 1.3109 1.3296 1.3578 1.6873 1.6980 1.4544 1.5284 1.1984 1.2123 1.2300 1.2407 1.0892 1.0476 1.0567 1.0833 1.0534 1.0549 1.0524 1.0601 1.0483 7.1811 5.6854 7.2510 1.0645 1.0806 1.0373 1.0388 1.0356 1.0364 1.0896 1.0875 1.0955 1.0979 1.0990 1.0998 1.0902 1.0930 1.0954 1.0978 1.0987 1.0948 1.0978 1.0899
irintensity: 1.8606 0.6380 0.6864 0.2767 1.2636 3.7701 0.1843 0.0283 0.1122 0.1412 3.4364 0.7301 0.5356 0.1511 0.0973 2.2185 0.0812 2.4278 1.2957 0.7900 0.5629 3.0603 2.6732 3.7171 7.9732 34.2896 12.3775 4.7228 8.1583 1.5177 2.8077 12.1549 18.7812 8.1416 16.9313 11.0372 0.5323 0.1924 46.7973 9.7441 11.6934 0.3194 19.3549 1.9693 12.8053 6.3173 3.6913 25.4719 23.5691 4.1875 31.5036 11.9495 12.3590 18.0175 3.8994 15.4272 36.3375 12.2333 22.0341 3.1404 21.0505 14.9387 15.4163 15.6780 8.2793 15.1443 6.6279 46.3243 4.7710 9.1482 17.1041 7.0540 20.0908 117.0987 123.7339 4.0519 37.0137 14.9087 19.2268 45.4020 27.4884 25.1727 18.1337 24.1388 15.7870 53.4290 25.2639 15.8311 19.7625 50.8957 7.8100 23.5085 28.9203 12.2398 67.7421 20.6251
temp: 298.150 k
press: 1.00000 atm
elementType: 8 6 6 6 6 6 6 6 6 6 6 6 6 6 1 1 1 1 1 1 1 1 1 1 1 1 1 1 1 1 1 1 1 1
symmnumber: 1
zpe: 773211.5 jmol-1
zpe.correction: 0.294501 hartree
zpe.thermalcorrener: 0.310326 hartree
zpe.thermalcorrenthalpy: 0.311270 hartree
zpe.thermalcorrgfe: 0.252189 hartree
zpe.sumelectzpe: -581.480744 hartree
zpe.sumelectthermal: -581.464919 hartree
zpe.sumelectthermalent: -581.463975 hartree
zpe.sumelectthermalfe: -581.523055 hartree
dipole: -1.0809 -0.8322 -2.4811
dipole: 2.8314
quadrupole: -74.0131 -85.8568 -90.9404
quadrupole: 2.0754 3.1179 -1.8431
quadrupole: 9.5903 -2.2534 -7.3369 2.0754 3.1179 -1.8431
hfenergy: -581.7752442 hartree
pointgroup: C01 [X(C13H20O1)]
dipole: -0.3850986 -0.2003388 -1.0258951 debye
polarizability: 182.629291|10.1817427|134.1665219|-0.084684|3.935636|114.3088671 unknown
InChI: InChI=1S/C13H20O/c1-5-7-11(14)12-10(2)8-6-9-13(12,3)4/h5-7,9-10,12H,8H2,1-4H3
charge 0 multiplicity 1
34 atoms
O  -1.24411 0.404891 1.660992
C  0.332448 0.308364 -0.206895
C  1.077249 -1.091631 -0.093415
C  1.169269 1.471839 0.408508
C  2.521383 1.603757 -0.336296
C  2.533838 -0.914571 -0.515181
C  1.043525 -1.667861 1.353378
C  0.41692 -2.123908 -1.053818
C  3.179005 0.272886 -0.631327
C  0.415206 2.821247 0.370166
C  -1.070305 0.231172 0.413629
C  -2.218135 -0.057683 -0.497675
C  -3.50224 -0.123645 -0.039808
C  -4.720372 -0.394375 -0.879384
H  0.221135 0.510052 -1.294201
H  1.366758 1.219234 1.468288
H  3.207917 2.234979 0.264237
H  2.366009 2.159323 -1.287834
H  3.073713 -1.849399 -0.731474
H  1.41707 -0.937706 2.090637
H  1.683635 -2.568343 1.410238
H  0.019052 -1.953473 1.650663
H  0.4341 -1.765626 -2.100296
H  -0.631604 -2.325144 -0.76883
H  0.964464 -3.084587 -1.016855
H  4.22907 0.288153 -0.956293
H  1.070176 3.639129 0.725713
H  0.101747 3.069637 -0.663273
H  -0.481246 2.804117 1.012103
H  -1.995509 -0.2018 -1.563185
H  -3.650934 0.038595 1.039241
H  -4.469098 -0.545606 -1.943044
H  -5.44075 0.444183 -0.804945
H  -5.255189 -1.293199 -0.51376
