program: Gaussian 09
title: 000093638
version: EM64L-G09RevD.01
frameworkgroup: C1[X(C13H11BrN2)]
method: RPBEPBE
basis: SDD
operation: Freq
keyword: #p
keyword: freq=noraman
keyword: PBEPBE/SDD
title: #p freq=noraman PBEPBE/SDD
converged: YES YES NO NO
title: Mulliken charges:
elementType: Br N N C C C C C C C C C C C C C H H H H H H H H H H H
charge: -0.042363 -0.113640 -0.115978 0.520940 0.170422 -0.332593 -0.321215 -0.341892 -0.289748 -0.855525 0.177636 -0.337452 -0.293121 -0.202866 -0.199632 -0.233268 0.239615 0.237098 0.254545 0.278387 0.287247 0.288133 0.252421 0.276004 0.233400 0.230723 0.232721
chargesum: 0.00000
title: Mulliken charges with hydrogens summed into heavy atoms:
elementType: Br N N C C C C C C C C C C C C C
charge: -0.042363 -0.113640 -0.115978 0.520940 0.170422 -0.092978 -0.084117 -0.087347 -0.011361 -0.280145 0.177636 -0.085030 -0.017117 0.030534 0.031091 -0.000548
polarizability: 4.27963992e+02 -1.02174642e+01 1.50638319e+02 -1.14274103e+01 -6.21845249e+00 8.92762144e+01
1716.lowfreq: -12.5895 0.0003 0.0005 0.0008 3.4937 4.8450 19.2029 29.5209 42.4750
frequency: 19.0168 29.5178 42.4420 74.0398 76.0939 114.1492 181.8804 211.9650 265.9952 275.1700 339.9553 353.2158 406.0207 410.0475 472.6129 500.1784 516.3577 527.8643 583.4083 608.5491 630.4442 635.0778 691.1576 747.2654 777.4713 785.7326 827.0904 846.6549 854.2207 867.0606 874.1215 900.1461 944.8573 978.7342 985.9643 989.2698 994.4667 1002.3998 1003.3834 1014.5228 1075.8240 1082.6834 1125.7932 1137.4894 1158.5006 1171.0196 1187.4599 1203.2948 1226.1132 1239.1793 1300.8903 1306.3523 1355.7396 1386.7220 1392.5572 1422.9539 1444.1346 1460.2747 1464.1477 1486.8022 1572.4387 1582.3232 1601.8432 1610.7937 3068.3371 3130.0138 3130.3315 3136.2623 3141.6050 3153.0554 3154.3058 3165.5722 3167.3085 3171.3266 3173.7139
redmass: 4.4103 9.0024 4.5309 8.3868 4.3425 7.3790 7.2520 5.8855 4.9800 4.8851 2.8846 5.7387 2.8921 2.9749 3.7366 7.2585 6.4708 3.9780 2.8745 6.5233 6.6120 6.2898 1.8650 3.4640 3.6264 2.0557 5.8105 1.2571 1.2469 1.6666 1.5255 5.9811 1.4374 1.3778 6.2043 1.3733 1.3623 2.6984 1.3289 2.0807 1.4898 1.2189 1.2293 2.0316 1.2549 1.0607 1.4774 1.1740 2.2737 4.5428 1.3392 1.4101 6.9475 6.0377 8.5164 3.6219 2.3996 1.1345 2.2028 2.6243 6.9595 6.2050 6.2680 6.3420 1.0574 1.0854 1.0899 1.0892 1.0889 1.1112 1.0931 1.0958 1.0960 1.0947 1.0999
irintensity: 0.3368 0.4184 0.0779 1.3164 3.0099 1.5996 1.5182 5.0948 0.5638 5.4661 1.8829 15.5705 0.3630 0.6968 19.1568 6.1246 21.6573 12.9408 82.2304 1.1226 11.7967 13.2478 56.9487 3.5600 30.3406 40.1350 9.0605 1.7659 0.1638 58.1019 1.5255 0.2252 8.4241 1.4640 2.2423 0.0176 0.7318 3.7608 0.7438 9.0798 6.9454 14.4599 3.5779 7.3395 40.1362 0.2276 0.9254 81.8219 69.9005 0.5133 0.0581 1.1571 4.4868 7.6547 0.7590 16.7878 7.8642 5.0371 5.3408 1.0496 0.5814 2.7498 8.7644 0.0371 18.6366 3.1575 10.9640 13.9406 9.6551 3.2894 21.4195 9.1406 16.8859 5.0934 32.9707
temp: 298.150 k
press: 1.00000 atm
elementType: 35 7 7 6 6 6 6 6 6 6 6 6 6 6 6 6 1 1 1 1 1 1 1 1 1 1 1
symmnumber: 1
zpe: 537994.7 jmol-1
zpe.correction: 0.204911 hartree
zpe.thermalcorrener: 0.218880 hartree
zpe.thermalcorrenthalpy: 0.219824 hartree
zpe.thermalcorrgfe: 0.160260 hartree
zpe.sumelectzpe: -623.794670 hartree
zpe.sumelectthermal: -623.780701 hartree
zpe.sumelectthermalent: -623.779757 hartree
zpe.sumelectthermalfe: -623.839322 hartree
dipole: 2.5074 0.3993 1.7165
dipole: 3.0647
quadrupole: -91.3966 -92.0420 -105.6288
quadrupole: -3.0939 -11.0453 -2.1560
quadrupole: 4.9592 4.3138 -9.2730 -3.0939 -11.0453 -2.1560
hfenergy: -623.9995816 hartree
pointgroup: C01[X(C13H11Br1N2)]
dipole: 0.9129075 0.0047117 0.7876838 debye
polarizability: 427.0972389|-10.6313043|150.6642888|20.423467|5.8944484|90.1169981 unknown
InChI: InChI=1S/C13H11BrN2/c14-10-11-6-8-13(9-7-11)16-15-12-4-2-1-3-5-12/h1-9H,10H2
charge 0 multiplicity 1
27 atoms
Br -6.160254 -0.090642 -1.543815
N  0.429437 0.566295 0.131837
N  1.172796 -0.508062 0.043011
C  -3.806405 0.042795 0.264388
C  -0.979485 0.30721 0.167211
C  -3.202593 1.327356 0.319649
C  -2.972353 -1.107572 0.155299
C  -1.80283 1.459604 0.271916
C  -1.575652 -0.985874 0.106961
C  -5.291622 -0.103191 0.33984
C  2.582912 -0.257898 0.004495
C  3.395851 -1.418532 -0.090325
C  3.185225 1.032694 0.052914
C  4.800421 -1.296866 -0.136213
C  4.586434 1.144704 0.006158
C  5.398644 -0.015763 -0.088175
H  -3.835048 2.219489 0.39366
H  -3.436775 -2.099649 0.10143
H  -1.317684 2.439896 0.316086
H  -0.924845 -1.861343 0.025797
H  -5.792467 0.73439 0.84527
H  -5.620178 -1.067852 0.751442
H  2.902886 -2.395584 -0.126579
H  2.539136 1.912768 0.125573
H  5.425601 -2.193122 -0.20919
H  5.055826 2.134181 0.042539
H  6.489421 0.081766 -0.124479
