program: Gaussian 09
title: 000093634
version: EM64L-G09RevD.01
frameworkgroup: C1[X(C11H15ClO4)]
method: RPBEPBE
basis: SDD
operation: Freq
keyword: #p
keyword: freq=noraman
keyword: PBEPBE/SDD
title: #p freq=noraman PBEPBE/SDD
converged: YES YES NO NO
title: Mulliken charges:
elementType: Cl O O O O C C C C C C C C C C C H H H H H H H H H H H H H H H
charge: -0.056084 -0.277758 -0.291437 -0.242194 -0.239567 0.013694 -0.277478 -0.613505 0.160637 0.181255 0.339129 0.342476 -0.749648 -0.759643 -0.624786 -0.625078 0.262349 0.258560 0.262631 0.280950 0.277336 0.245940 0.243762 0.215383 0.240841 0.236570 0.219747 0.232729 0.255968 0.230733 0.256489
chargesum: 0.00000
title: Mulliken charges with hydrogens summed into heavy atoms:
elementType: Cl O O O O C C C C C C C C C C C
charge: -0.056084 -0.277758 -0.291437 -0.242194 -0.239567 0.276043 0.243712 -0.055218 0.160637 0.181255 0.339129 0.342476 -0.044563 -0.062485 -0.136090 -0.137856
polarizability: 1.92572498e+02 -8.52617916e+00 1.26570789e+02 2.51422841e-01 -3.59287856e+00 1.15148091e+02
1716.lowfreq: -6.7752 -4.2346 0.0022 0.0023 0.0024 4.7960 16.9347 24.5411 28.5371
frequency: 16.7911 24.3397 28.3962 41.9253 56.5190 64.4594 68.5341 102.3116 126.5758 169.2867 174.4064 180.7899 202.4004 217.7476 225.3288 280.7412 335.0971 355.3308 369.1034 388.3539 392.9265 417.3023 478.5792 512.8092 550.1865 574.9392 588.0051 630.9619 631.4405 661.6944 782.8674 783.2635 789.3595 799.1811 848.7515 910.0172 927.5491 947.1800 967.2540 978.4820 992.5757 994.0733 1008.5427 1011.6089 1045.5697 1053.8111 1054.5300 1091.2297 1111.7845 1136.2439 1179.9222 1215.5423 1273.0990 1285.2751 1289.4699 1305.8881 1340.0667 1371.3490 1395.7566 1400.3327 1416.2159 1416.9461 1426.6229 1457.3057 1457.5631 1466.1928 1472.0506 1473.2569 1612.4240 1617.0991 1652.3959 1654.4234 2988.0233 2993.3910 3001.7453 3031.2916 3070.7570 3071.2738 3077.1933 3098.1455 3101.5857 3104.0829 3105.4639 3105.7046 3154.7225 3217.6001 3217.6208
redmass: 4.8813 4.8428 4.7304 4.7675 6.9330 4.9851 4.7835 4.2563 6.4905 1.8606 1.5604 1.0399 5.3234 3.4800 3.1648 4.1820 3.7570 3.6639 2.7885 2.9394 3.4680 4.0300 4.2006 4.3804 5.4461 3.9070 3.7991 1.5509 1.5419 4.6604 2.0827 2.0884 3.3646 6.8386 3.5061 2.4111 2.6979 1.9197 3.1623 2.5170 1.3160 1.3147 1.3969 1.3971 1.7089 1.5066 1.5034 5.0334 5.0840 1.8108 1.1304 1.3023 1.6732 1.6339 2.4329 1.9299 1.5423 1.5502 1.1705 1.1611 1.2469 1.2555 1.1047 1.0443 1.0456 1.0727 1.0611 1.0616 11.2326 11.1591 5.1673 5.2642 1.0363 1.0363 1.0824 1.0569 1.0740 1.0798 1.0970 1.1005 1.1006 1.1085 1.0620 1.0622 1.1106 1.1157 1.1157
irintensity: 0.3337 0.7557 1.9063 0.7821 3.4415 1.1957 1.2834 0.0892 0.5213 0.5934 2.4548 0.6269 3.0248 6.5826 9.0449 13.5647 3.9467 15.4360 4.7155 0.0676 0.2751 6.0460 6.4823 14.4924 3.0238 2.5612 6.9351 12.5349 11.3382 22.5885 8.2387 7.3255 12.2811 10.6529 13.6974 7.7760 6.7331 3.4736 16.3325 57.2005 56.4082 57.4575 22.4092 21.4288 25.3007 6.8638 6.3142 867.9477 173.5992 4.1380 1.1101 5.2687 40.3705 52.4225 63.2933 52.3646 2.7721 3.7522 20.1758 22.8025 14.3524 9.5336 20.4751 17.1818 16.9146 18.9460 57.3675 21.3952 159.3367 108.7152 6.8467 4.7130 15.9243 13.4837 14.1197 11.0207 11.6235 18.0709 14.0313 29.7303 26.4250 4.9065 5.1246 3.1586 6.5428 6.9071 3.1424
temp: 298.150 k
press: 1.00000 atm
elementType: 17 8 8 8 8 6 6 6 6 6 6 6 6 6 6 6 1 1 1 1 1 1 1 1 1 1 1 1 1 1 1
symmnumber: 1
zpe: 631741.7 jmol-1
zpe.correction: 0.240618 hartree
zpe.thermalcorrener: 0.259187 hartree
zpe.thermalcorrenthalpy: 0.260131 hartree
zpe.thermalcorrgfe: 0.189924 hartree
zpe.sumelectzpe: -1187.864552 hartree
zpe.sumelectthermal: -1187.845983 hartree
zpe.sumelectthermalent: -1187.845039 hartree
zpe.sumelectthermalfe: -1187.915246 hartree
dipole: 0.4174 0.6926 2.1823
dipole: 2.3273
quadrupole: -77.7038 -111.2005 -103.7338
quadrupole: -1.0051 -9.5452 3.7244
quadrupole: 19.8422 -13.6544 -6.1877 -1.0051 -9.5452 3.7244
hfenergy: -1188.1051699 hartree
pointgroup: C01 [X(C11H15Cl1O4)]
dipole: -0.1833127 -0.4860353 0.7540164 debye
polarizability: 192.3619421|-9.3006641|124.2251959|-1.2433193|5.8885182|117.7042397 unknown
InChI: InChI=1S/C11H15ClO4/c1-7(2)10(13)15-6-9(5-12)16-11(14)8(3)4/h9H,1,3,5-6H2,2,4H3
charge 0 multiplicity 1
31 atoms
Cl -0.177068 -2.919668 -1.33201
O  -1.858916 -0.489679 -0.121987
O  1.815977 -0.070175 0.14329
O  -2.16361 1.262452 1.395333
O  2.668863 1.357687 -1.486434
C  -0.487394 -0.695471 0.412061
C  0.467589 0.158149 -0.43228
C  -0.202001 -2.189744 0.40765
C  -2.611643 0.551422 0.463057
C  2.868108 0.605001 -0.503771
C  -3.961108 0.64916 -0.180177
C  4.185851 0.296427 0.14172
C  -4.300849 -0.29338 -1.315491
C  4.224472 -0.659139 1.316194
C  -4.808129 1.599382 0.305221
C  5.286957 0.904262 -0.380507
H  -0.460374 -0.337858 1.461748
H  0.457904 -0.151467 -1.491136
H  0.209735 1.228287 -0.357492
H  0.795724 -2.387298 0.824791
H  -0.98126 -2.744997 0.948776
H  -3.587582 -0.181881 -2.151383
H  -4.234774 -1.34731 -0.99175
H  -5.319894 -0.099379 -1.689955
H  3.590369 -0.296465 2.144929
H  3.835582 -1.653284 1.029977
H  5.256208 -0.779473 1.687028
H  -5.811348 1.734031 -0.112794
H  -4.501105 2.253821 1.128391
H  6.28522 0.729988 0.034892
H  5.195095 1.5849 -1.233891
