program: Gaussian 09
title: 000093650
version: EM64L-G09RevD.01
frameworkgroup: C1[X(C17H26O2)]
method: RPBEPBE
basis: SDD
operation: Freq
keyword: #pfreq=noraman
keyword: PBEPBE/SDD
title: #p freq=noraman PBEPBE/SDD
converged: NO YES NO NO
title: Mulliken charges:
elementType: O O C C C C C C C C C C C C C C C C C H H H H H H H H H H H H H H H H H H H H H H H H H H
charge: -0.371528 -0.192549 0.149290 0.013630 -0.469909 -0.020354 0.549418 -0.725178 -0.797840 -0.770815 -0.737806 -0.740474 -0.532874 -0.405256 0.216100 -0.436104 0.139466 0.089038 -0.805341 0.193334 0.187611 0.205029 0.186379 0.211234 0.216097 0.224303 0.222745 0.215772 0.224009 0.219351 0.236787 0.217775 0.210895 0.213371 0.211118 0.210809 0.221551 0.221032 0.243386 0.255431 0.215473 0.352049 0.235285 0.235274 0.262984
chargesum: 0.00000
title: Mulliken charges with hydrogens summed into heavy atoms:
elementType: O O C C C C C C C C C C C C C C C C C
charge: -0.019479 -0.192549 0.149290 0.206964 -0.077270 0.166025 0.549418 -0.073543 -0.135314 -0.096902 -0.102422 -0.087081 -0.289488 -0.149825 0.216100 -0.220631 0.139466 0.089038 -0.071798
polarizability: 2.25766657e+02 1.58445738e+01 1.90128506e+02 1.95686072e+01 -1.62521452e+01 1.62602708e+02
1716.lowfreq: -23.2403 -15.9467 -8.1736 0.0005 0.0006 0.0008 3.9977 14.4231 27.6495
frequency: -16.0473 -6.8532 27.2456 41.0290 65.8293 108.4047 125.2687 130.2853 148.2065 177.3184 181.6596 195.9969 207.5086 232.2938 237.1879 244.5820 257.3279 274.3084 285.5707 298.4947 314.3189 322.5266 342.2744 364.0944 380.5838 391.0322 414.7313 419.8479 427.9501 463.2026 488.8861 490.1683 529.6593 533.1159 554.7451 604.6251 647.3232 661.5402 729.7619 741.6141 761.8615 812.7444 817.6864 840.5646 866.2732 898.9392 903.1901 911.4825 921.3059 929.5276 938.6749 946.3507 950.8269 959.4283 997.7466 1019.4768 1020.1214 1037.4020 1056.1055 1084.4825 1105.5632 1117.7543 1123.1979 1147.8495 1165.2867 1182.8505 1189.6562 1199.2044 1217.1882 1249.8186 1260.7133 1269.5655 1289.5654 1299.5950 1313.0899 1329.4184 1343.1258 1359.3537 1364.1466 1373.9559 1375.5350 1379.4282 1387.0562 1395.3453 1396.4612 1401.3197 1451.2955 1458.2252 1464.7627 1465.9228 1466.7710 1467.2829 1469.8162 1474.5973 1483.5281 1486.8493 1487.2536 1489.3002 1493.8885 1495.6271 1571.9994 1600.9179 1616.9405 2941.2243 2955.0362 2956.7605 2970.2669 2970.4580 2976.5835 2977.7769 2982.0336 2984.1408 3014.1497 3061.8105 3064.7797 3066.1507 3068.3541 3068.4985 3069.2601 3073.3762 3073.8469 3075.4039 3076.2383 3085.7208 3105.8308 3121.2379 3156.8397 3161.5545 3526.4888
redmass: 2.7273 4.2420 4.6284 4.1761 2.6425 3.8389 3.2135 3.0405 2.5888 1.0660 1.1086 3.1737 1.2282 1.1653 1.6706 1.6365 2.9074 2.8067 2.4884 2.4688 2.8998 1.2711 2.6607 2.3693 6.6431 2.4064 1.3788 3.0273 2.1844 2.8756 2.5684 3.1889 2.9176 2.3964 2.5872 4.2208 3.0028 5.1279 5.5113 3.1703 2.8086 1.5776 2.7718 2.3485 2.5314 1.7100 1.6924 1.2483 1.7487 1.5357 2.2496 1.4124 1.3934 1.6874 1.3145 1.5287 1.7766 1.8480 2.4552 1.5803 2.2719 1.8090 2.1835 2.2214 2.3015 1.4441 1.7236 2.1085 2.1400 2.7887 2.4692 1.5170 1.6495 1.4163 1.4631 1.3907 1.4466 1.3848 1.2400 1.4133 1.2173 2.8251 1.2879 1.3931 1.2118 2.5702 1.0904 1.0768 1.0517 1.0501 1.0508 1.0586 1.0560 1.0574 1.0491 1.0500 1.0549 1.0667 1.2206 1.9039 6.1970 6.8743 6.7101 1.0814 1.0606 1.0822 1.0356 1.0348 1.0363 1.0365 1.0373 1.0370 1.0988 1.0997 1.0994 1.0999 1.0993 1.0977 1.0985 1.0986 1.0987 1.0990 1.0993 1.0975 1.0894 1.0989 1.0889 1.0928 1.0655
irintensity: 0.0486 5.7094 1.3590 0.1646 0.0179 0.0557 0.5780 0.7377 0.5083 0.9903 0.2650 0.5858 0.2465 0.8549 1.6101 0.7397 1.6718 1.7642 0.2215 0.2012 0.8465 0.5208 1.9792 0.3844 6.1562 0.7293 89.7695 4.6544 28.4673 4.9453 2.7769 4.4859 4.2921 4.2547 7.3236 22.0523 10.3418 3.3729 7.5573 0.2603 5.7821 39.4948 14.8117 2.1324 2.1786 11.7106 2.5548 0.5727 3.5588 7.5130 23.2586 0.3077 0.3635 1.8852 0.7192 1.0944 1.5761 21.9937 36.9641 1.7030 19.9831 165.7113 10.5452 1.8552 7.5329 12.9799 4.9159 4.6516 46.1653 121.1842 49.6479 36.3546 22.7718 31.4274 9.5462 5.6624 2.2983 4.7160 40.1767 29.6404 9.9085 33.4362 15.7026 7.2979 22.8815 7.1352 31.8295 2.5466 3.5776 14.9461 11.5739 5.9517 1.6959 13.8501 11.3427 9.9551 20.2462 6.6484 1.2894 58.8476 158.3198 37.1409 70.3766 15.2701 37.1315 23.9185 35.5252 41.9509 21.4329 24.1958 5.1621 18.5206 43.2543 2.2015 38.7494 7.3791 24.1189 24.6058 110.3526 49.3566 37.9460 80.1479 43.5673 28.7140 20.4908 16.9168 11.2944 6.8632 26.1610
temp: 298.150 k
press: 1.00000 atm
elementType: 8 8 6 6 6 6 6 6 6 6 6 6 6 6 6 6 6 6 6 1 1 1 1 1 1 1 1 1 1 1 1 1 1 1 1 1 1 1 1 1 1 1 1 1 1
symmnumber: 1
zpe: 1016823.1 jmol-1
zpe.correction: 0.387287 hartree
zpe.thermalcorrener: 0.407376 hartree
zpe.thermalcorrenthalpy: 0.408320 hartree
zpe.thermalcorrgfe: 0.340185 hartree
zpe.sumelectzpe: -812.367698 hartree
zpe.sumelectthermal: -812.347610 hartree
zpe.sumelectthermalent: -812.346665 hartree
zpe.sumelectthermalfe: -812.414800 hartree
dipole: 3.7992 3.2596 0.0888
dipole: 5.0066
quadrupole: -135.0322 -114.3965 -111.6443
quadrupole: -14.2974 4.8151 -7.8585
quadrupole: -14.6745 5.9612 8.7134 -14.2974 4.8151 -7.8585
hfenergy: -812.7549853 hartree
pointgroup: C01 [X(C17H26O2)]
dipole: -1.5305062 -1.2216975 -0.2120718 debye
polarizability: 227.9765443|16.55252|183.3634447|-14.2778028|20.7653657|167.1578813 unknown
InChI: InChI=1S/C17H26O2/c1-11(2)12(3)10-17(5,6)14-7-8-16(19)15(9-14)13(4)18/h7-9,11-12,19H,10H2,1-6H3
charge 0 multiplicity 1
45 atoms
O  4.186725 -0.128366 -1.341912
O  4.206615 1.842824 0.512955
C  -1.05333 -1.557284 0.744188
C  -2.725391 0.167895 -0.48158
C  -2.040785 -0.335574 0.82127
C  -3.907799 1.139298 -0.128499
C  0.321792 -1.174824 0.142952
C  -0.804408 -2.038524 2.211112
C  -1.722782 -2.726337 -0.022619
C  -1.728317 0.781305 -1.494222
C  -4.842321 1.373721 -1.340509
C  -3.448924 2.494412 0.465149
C  1.061014 -0.094658 0.679081
C  0.932321 -1.904495 -0.908792
C  2.350256 0.296544 0.221752
C  2.206393 -1.555695 -1.39478
C  2.925209 -0.46521 -0.847792
C  3.050772 1.463937 0.858144
C  2.319566 2.222451 1.975062
H  -3.204685 -0.708098 -0.969568
H  -2.846127 -0.631503 1.527307
H  -1.514412 0.513013 1.302153
H  -4.509627 0.621887 0.651001
H  -1.747177 -2.397861 2.665184
H  -0.41355 -1.220637 2.84385
H  -0.069875 -2.86413 2.234137
H  -1.854304 -2.509155 -1.097847
H  -1.132867 -3.657178 0.070034
H  -2.723485 -2.924671 0.403248
H  -2.253452 1.190958 -2.376107
H  -1.008093 0.028033 -1.855478
H  -1.139317 1.597928 -1.037507
H  -4.335842 1.944581 -2.140855
H  -5.736328 1.951612 -1.03992
H  -5.187213 0.415403 -1.773284
H  -4.325046 3.103764 0.755691
H  -2.869488 3.079342 -0.272867
H  -2.822386 2.363962 1.366119
H  0.620126 0.480942 1.498103
H  0.417334 -2.755919 -1.362825
H  2.653082 -2.137882 -2.212614
H  4.43687 -0.747329 -2.076451
H  2.100439 1.566223 2.837969
H  1.361548 2.64694 1.621236
H  2.971771 3.043358 2.309735
