program: Gaussian 09
title: 000093618
version: EM64L-G09RevD.01
frameworkgroup: C1[X(C11H15NO2)]
method: RPBEPBE
basis: SDD
operation: Freq
keyword: #p
keyword: freq=noraman
keyword: PBEPBE/SDD
title: #p freq=noraman PBEPBE/SDD
converged: YES YES NO NO
title: Mulliken charges:
elementType: O O N C C C C C C C C C C C H H H H H H H H H H H H H H H
charge: -0.246251 -0.406286 -0.365699 -0.330989 -0.391195 -0.349011 -0.685400 0.154974 0.164447 0.149995 -0.355825 -0.389358 -0.251436 -0.198173 0.219977 0.194262 0.205728 0.258344 0.191020 0.192559 0.312287 0.213932 0.214976 0.210155 0.249552 0.219932 0.231290 0.229713 0.356482
chargesum: 0.00000
title: Mulliken charges with hydrogens summed into heavy atoms:
elementType: O O N C C C C C C C C C C C
charge: -0.246251 -0.049804 -0.053412 0.083249 0.072878 0.034568 -0.046337 0.154974 0.164447 0.149995 -0.106273 -0.169426 -0.020147 0.031540
polarizability: 1.71408742e+02 4.50087418e+00 1.41611418e+02 -9.29369857e-01 -8.12972991e-01 8.28428516e+01
1716.lowfreq: -8.7970 -0.0010 -0.0007 -0.0006 3.6254 9.5531 15.4792 36.2209 46.7030
frequency: 15.1537 36.2132 46.6442 72.3204 92.5782 123.0772 166.1908 200.3162 224.8853 228.4992 283.5105 287.7085 335.7193 349.2271 380.0340 433.4428 482.8744 519.8598 530.5450 553.8499 568.4219 641.7426 699.6673 730.9148 754.7279 758.0033 759.7699 809.4198 841.4853 850.6260 856.1136 934.5353 943.0433 971.0937 975.2490 1026.6237 1039.4617 1059.6520 1085.9631 1117.7213 1133.2065 1152.4984 1154.8587 1172.5950 1226.4296 1249.3812 1250.8908 1269.4451 1287.8096 1289.5899 1311.6212 1349.1778 1367.5268 1388.7617 1390.5213 1427.5829 1446.6828 1459.6321 1472.6052 1475.4336 1476.7557 1486.7969 1492.2466 1590.6867 1608.5547 1614.5331 2958.2226 2973.9640 2977.1024 2991.4476 3003.0295 3043.3632 3069.7869 3071.5874 3073.2857 3114.5533 3128.3715 3145.0283 3167.9587 3557.2945 3576.1876
redmass: 4.0104 4.5422 5.3770 1.7981 3.0859 3.1645 4.5405 3.9670 2.2503 1.5482 4.5138 2.5558 1.1648 3.3064 3.8005 3.9052 3.0500 2.3506 4.9748 1.4951 3.0710 5.7095 4.6856 1.3835 1.7949 2.2810 2.2736 3.3686 1.6905 1.7177 2.1024 1.5523 1.5311 1.5913 1.3420 3.7207 2.2992 2.4737 2.1240 2.0287 2.0604 1.6165 1.7245 1.0584 1.3250 2.0599 2.1528 1.6344 1.1241 1.4111 1.2512 1.4941 1.3458 7.3936 1.2151 2.3086 1.1776 1.0851 1.2536 1.3032 1.0783 1.0843 2.5853 6.5131 6.7602 7.3025 1.0589 1.0376 1.0596 1.0650 1.0978 1.1005 1.1003 1.1009 1.0996 1.0884 1.0881 1.0926 1.1004 1.0779 1.0661
irintensity: 1.1065 2.2380 4.0499 1.2178 2.6665 1.6046 0.6458 0.3624 3.5325 3.1252 5.8619 2.3731 125.5526 4.4411 13.1309 16.5075 16.3989 2.4324 13.3791 75.6146 18.3886 7.5721 12.7802 12.6412 68.7312 23.6158 3.3873 21.1524 1.0837 1.4832 12.3482 11.4988 2.4791 14.2883 1.4831 4.2360 5.6384 28.3461 86.0606 0.7883 3.5154 10.5196 82.8859 3.2269 2.7447 9.5234 42.7357 101.8980 4.9691 43.7731 34.2806 0.5895 2.7752 10.3933 10.7067 29.2161 60.8794 6.2629 88.4414 64.9286 49.2135 13.7186 57.0573 37.9983 23.2105 173.5369 29.9979 25.6083 58.7865 43.5881 6.7380 49.7630 26.2781 55.2701 57.4325 14.3017 3.5002 20.1048 20.8272 15.1658 34.2842
temp: 298.150 k
press: 1.00000 atm
elementType: 8 8 7 6 6 6 6 6 6 6 6 6 6 6 1 1 1 1 1 1 1 1 1 1 1 1 1 1 1
symmnumber: 1
zpe: 629139.4 jmol-1
zpe.correction: 0.239627 hartree
zpe.thermalcorrener: 0.254234 hartree
zpe.thermalcorrenthalpy: 0.255179 hartree
zpe.thermalcorrgfe: 0.195865 hartree
zpe.sumelectzpe: -632.318084 hartree
zpe.sumelectthermal: -632.303476 hartree
zpe.sumelectthermalent: -632.302532 hartree
zpe.sumelectthermalfe: -632.361846 hartree
dipole: 0.8431 2.6628 -2.9439
dipole: 4.0581
quadrupole: -61.1964 -84.6024 -88.6173
quadrupole: -0.9986 -0.5184 5.0801
quadrupole: 16.9423 -6.4637 -10.4786 -0.9986 -0.5184 5.0801
hfenergy: -632.5577108 hartree
pointgroup: C01 [X(C11H15N1O2)]
dipole: 0.3594346 1.1548759 -1.0421499 debye
polarizability: 171.682505|3.50674|140.7815596|-1.5830663|5.5647387|83.3989472 unknown
InChI: InChI=1S/C11H15NO2/c1-2-3-8-12-11(14)9-6-4-5-7-10(9)13/h4-7,12-13H,2-3,8H2,1H3
charge 0 multiplicity 1
29 atoms
O  -0.17331 -1.937195 0.973353
O  2.500915 -1.995422 -0.49365
N  -1.116687 -0.540936 -0.638971
C  -3.493872 -0.483839 0.213689
C  -2.426926 -1.214768 -0.636187
C  -3.865011 0.92044 -0.313572
C  -4.943569 1.612589 0.54791
C  -0.074845 -0.949507 0.18608
C  1.160025 -0.079903 0.090487
C  2.441818 -0.632532 -0.179186
C  1.06722 1.309138 0.354932
C  3.595502 0.188893 -0.169282
C  2.212914 2.136426 0.367954
C  3.480182 1.568254 0.108253
H  -3.127853 -0.410319 1.256247
H  -4.404746 -1.116717 0.240316
H  -2.775856 -1.31336 -1.682661
H  -2.257297 -2.227655 -0.230252
H  -4.223952 0.83597 -1.360553
H  -2.956326 1.556547 -0.341184
H  -0.946146 0.225631 -1.291316
H  -4.597028 1.734076 1.591355
H  -5.195884 2.614723 0.155304
H  -5.87385 1.014355 0.572665
H  0.084499 1.737018 0.586152
H  4.579572 -0.248234 -0.384136
H  2.118666 3.204445 0.588156
H  4.379147 2.194056 0.118969
H  3.4380 -2.291375 -0.61077
