program: Gaussian 09
title: 000093649
version: EM64L-G09RevD.01
frameworkgroup: C1[X(C17H18O2)]
method: RPBEPBE
basis: SDD
operation: Freq
keyword: #pfreq=noraman
keyword: PBEPBE/SDD
title: #p freq=noraman PBEPBE/SDD
converged: YES YES NO NO
title: Mulliken charges:
elementType: O O C C C C C C C C C C C C C C C C C H H H H H H H H H H H H H H H H H H
charge: -0.294875 -0.294411 0.545518 0.249901 0.194879 -0.595454 -0.621338 -0.410340 -0.416605 -0.324337 0.436826 -0.437228 -0.377091 -0.026546 -0.222464 -0.220750 -0.239019 -0.528136 -0.592479 0.256312 0.216205 0.221162 0.242050 0.218745 0.226644 0.246947 0.230549 0.261866 0.231850 0.227671 0.228628 0.229833 0.227125 0.210517 0.265490 0.214674 0.217681
chargesum: 0.00000
title: Mulliken charges with hydrogens summed into heavy atoms:
elementType: O O C C C C C C C C C C C C C C C C C
charge: -0.294875 -0.294411 0.545518 0.249901 0.194879 -0.339142 -0.183971 -0.168290 0.028784 -0.077390 0.436826 -0.206679 -0.115224 0.205305 0.005207 0.007878 -0.009186 0.174996 -0.160124
polarizability: 2.87279654e+02 2.08900459e+01 1.80690680e+02 6.26417418e-01 2.12742786e+01 1.15283366e+02
1716.lowfreq: -3.7669 -0.0004 0.0007 0.0009 2.8092 7.8350 19.8327 26.5824 36.8481
frequency: 19.8208 26.4804 36.7999 46.5508 70.2889 77.6279 88.6359 121.5834 137.0107 157.8178 189.7892 190.3189 224.0709 257.4591 277.2035 310.3060 366.5303 389.8066 390.4920 403.2367 457.2079 469.3602 483.9510 510.5214 573.0191 593.9915 607.1234 617.8310 651.2051 702.7097 729.9736 731.7866 745.3252 771.1189 806.4635 828.4777 856.8448 869.2831 888.4283 916.2776 917.3773 936.2507 936.7456 946.0350 970.2763 980.7664 989.8253 996.0605 997.1229 1012.3091 1014.6321 1027.4030 1086.0946 1104.8920 1112.3308 1112.9457 1156.8639 1165.3397 1172.6953 1186.0697 1198.4885 1201.8583 1213.6089 1222.3283 1255.8808 1275.1214 1282.1313 1295.5334 1316.1242 1353.9150 1378.5300 1391.0530 1403.2546 1424.6567 1439.1469 1441.7811 1455.5021 1456.3077 1472.8266 1483.8809 1485.7290 1496.4525 1578.8098 1596.0789 1614.2824 1618.1941 1654.4597 2941.0072 2966.0538 2973.1133 3001.3214 3016.3938 3080.6247 3082.3039 3096.2498 3115.8754 3124.4553 3128.0021 3134.3185 3141.0667 3144.0376 3154.4572 3160.1451 3166.4292 3194.5116
redmass: 4.1316 4.2187 3.2426 4.7287 3.4552 2.2818 2.9500 3.6097 1.6578 3.0598 3.3597 2.7658 4.4938 3.3772 3.8533 3.5082 4.0320 3.8447 2.4965 2.8418 4.7764 3.2517 3.2151 2.7968 4.3163 4.9598 2.5432 5.9487 3.5658 2.1346 3.6512 3.6296 1.6097 3.5965 1.5192 3.8067 1.2525 2.7910 1.7824 1.3580 1.4283 1.7270 1.6594 1.5126 6.8362 1.3954 6.0703 2.9126 1.4562 1.7080 1.1727 2.1400 1.5567 2.5662 1.6468 1.2753 1.3682 1.5745 1.0547 1.1182 1.7355 1.2095 1.3826 2.1093 3.6867 1.7131 1.3233 1.3480 1.3572 1.7135 6.1814 3.7471 2.2586 1.1936 1.5392 1.8936 1.1060 1.0689 1.2087 1.0540 2.3779 2.2798 7.3198 6.1656 6.5828 6.1016 4.6789 1.0570 1.0591 1.0346 1.1040 1.1001 1.0974 1.0626 1.0911 1.0874 1.1044 1.0867 1.0880 1.0921 1.0914 1.0957 1.0948 1.1011 1.1142
irintensity: 0.2492 0.4042 0.4769 0.1351 1.7342 5.7561 1.2565 4.4050 0.1368 3.3311 0.9031 1.1036 0.9072 6.0101 3.5935 8.2484 1.0145 1.3414 1.1128 0.8738 1.9878 3.2100 13.8848 4.2534 0.3800 5.3172 10.2767 0.5625 11.5114 34.7313 11.0265 2.2571 72.8822 6.9084 43.0988 7.6728 0.1424 3.2853 23.1049 3.1674 23.5089 8.3434 6.1604 88.1971 91.9729 2.1548 0.1340 50.5136 4.7449 0.6476 29.9319 7.9013 8.5611 96.9839 8.0948 4.9397 6.6312 10.9402 0.4878 9.3557 84.0109 6.1013 41.3584 4.3708 252.9180 18.7582 2.5762 2.0222 10.0275 20.8801 7.0557 6.9943 9.7895 5.6884 12.6313 7.9014 41.9968 0.0997 75.9139 18.3368 0.7053 144.1287 17.4399 0.8647 12.2792 4.4968 20.1968 30.6198 30.5542 84.4987 28.9765 14.5851 32.1732 17.8822 8.9791 8.5683 17.6386 0.4010 10.1472 23.4930 9.0090 30.5516 12.6193 17.9433 29.5982
temp: 298.150 k
press: 1.00000 atm
elementType: 8 8 6 6 6 6 6 6 6 6 6 6 6 6 6 6 6 6 6 1 1 1 1 1 1 1 1 1 1 1 1 1 1 1 1 1 1
symmnumber: 1
zpe: 789781.0 jmol-1
zpe.correction: 0.300812 hartree
zpe.thermalcorrener: 0.319247 hartree
zpe.thermalcorrenthalpy: 0.320191 hartree
zpe.thermalcorrgfe: 0.251443 hartree
zpe.sumelectzpe: -807.624899 hartree
zpe.sumelectthermal: -807.606464 hartree
zpe.sumelectthermalent: -807.605520 hartree
zpe.sumelectthermalfe: -807.674268 hartree
dipole: 1.3462 -1.4819 -1.2773
dipole: 2.3748
quadrupole: -101.3878 -106.2470 -112.5673
quadrupole: 0.6639 0.8392 0.9580
quadrupole: 5.3462 0.4870 -5.8333 0.6639 0.8392 0.9580
hfenergy: -807.9257106 hartree
pointgroup: C01 [X(C17H18O2)]
dipole: -0.5282941 0.2378262 -0.7330032 debye
polarizability: 286.0077611|23.5761651|147.856442|-7.4710155|-39.0208057|149.3894964 unknown
InChI: InChI=1S/C17H18O2/c1-3-7-14-10-11-16(17(12-14)18-2)19-13-15-8-5-4-6-9-15/h3-6,8-12H,1,7,13H2,2H3
charge 0 multiplicity 1
37 atoms
O  -0.813498 -0.351753 -0.142124
O  0.688069 -2.195791 1.403418
C  3.443314 -0.13468 -0.014481
C  0.59053 -0.248253 -0.159666
C  1.309924 -1.212149 0.611174
C  2.716682 -1.135183 0.67574
C  4.972113 -0.098168 0.049747
C  2.719149 0.800794 -0.790735
C  -1.584245 0.721847 -0.794983
C  1.309843 0.744369 -0.866124
C  -3.053259 0.498409 -0.496064
C  -4.027553 0.790236 -1.48145
C  -3.47207 0.041929 0.778964
C  5.543016 1.29592 0.235216
C  -5.404032 0.641777 -1.195395
C  -4.84662 -0.116169 1.061453
C  -5.817422 0.187709 0.077824
C  -0.273016 -3.100865 0.737309
C  6.451796 1.88035 -0.585708
H  3.230781 -1.883096 1.289877
H  5.304939 -0.741971 0.888921
H  5.400383 -0.53997 -0.872597
H  3.25905 1.583771 -1.33491
H  -1.399962 0.714009 -1.888512
H  -1.241468 1.698597 -0.390667
H  0.780099 1.485846 -1.471698
H  -3.71338 1.131294 -2.476013
H  -2.716145 -0.201042 1.53307
H  5.173093 1.847591 1.113027
H  -6.148931 0.871087 -1.965568
H  -5.161098 -0.474139 2.048283
H  -6.883656 0.067169 0.299794
H  -0.589764 -3.803645 1.523209
H  0.225718 -3.655183 -0.081667
H  -1.137667 -2.542748 0.343045
H  6.839515 2.886731 -0.391635
H  6.836671 1.364369 -1.474774
