program: Gaussian 09
title: 000093610
version: EM64L-G09RevD.01
frameworkgroup: C1[X(C12H22N2O)]
method: RPBEPBE
basis: SDD
operation: Freq
keyword: #p
keyword: freq=noraman
keyword: PBEPBE/SDD
title: #p freq=noraman PBEPBE/SDD
converged: YES YES NO NO
title: Mulliken charges:
elementType: O N N C C C C C C C C C C C C H H H H H H H H H H H H H H H H H H H H H H
charge: -0.290826 -0.139192 -0.042517 -0.186979 -0.183368 -0.461307 -0.384630 -0.434485 -0.397991 0.211097 -0.616094 -0.482178 -0.356008 -0.343754 -0.695124 0.240950 0.293211 0.216908 0.243584 0.215698 0.227509 0.209393 0.214666 0.223286 0.190320 0.212001 0.229646 0.218550 0.215566 0.215197 0.212212 0.212190 0.187285 0.187328 0.212388 0.212526 0.212944
chargesum: 0.00000
title: Mulliken charges with hydrogens summed into heavy atoms:
elementType: O N N C C C C C C C C C C C C
charge: -0.290826 -0.139192 -0.042517 0.053971 0.109843 -0.000815 0.058576 -0.010427 0.015615 0.211097 0.044103 -0.051415 0.068394 0.030859 -0.057266
polarizability: 1.67415028e+02 4.79297980e+00 1.37441439e+02 -2.49607485e+00 -2.34334537e+00 1.17916601e+02
1716.lowfreq: -17.7657 -2.3789 0.0003 0.0005 0.0006 6.5784 34.1507 40.9871 61.9350
frequency: 33.8160 40.7581 61.7914 74.0733 92.5853 120.2001 132.9382 190.0922 199.2148 228.6048 230.9915 242.8826 292.2907 308.7014 337.8563 354.8942 394.3598 412.4556 464.0023 504.4981 528.5533 554.1880 581.4932 697.2062 723.5977 734.8983 760.1077 794.2535 798.0170 812.2139 892.9664 900.2856 905.4638 920.4118 928.1266 945.2101 960.8071 1012.0143 1024.9317 1040.6795 1046.1571 1074.9021 1085.9190 1091.8219 1097.3212 1111.4237 1113.9233 1117.1576 1129.1967 1140.4009 1148.3886 1193.5193 1206.2176 1227.3169 1238.5097 1250.4963 1267.4826 1278.0371 1282.0474 1286.0705 1298.9414 1314.5700 1318.4386 1320.4301 1343.8441 1354.5018 1363.1937 1377.6273 1379.5868 1391.7193 1438.7416 1440.9138 1454.6251 1461.8277 1464.5960 1467.8017 1471.5042 1474.6134 1476.7640 1484.8189 1487.5000 1490.5557 1579.9129 2852.5722 2916.8553 2951.6457 2958.5113 2959.9559 2974.1976 2988.6736 2997.6080 2999.1527 3002.7337 3013.5808 3017.5032 3022.7051 3027.6711 3045.0659 3050.5712 3058.6100 3071.5188 3072.9721 3090.6693 3094.2877 3103.8952
redmass: 2.8821 1.7982 3.9071 3.8493 3.3739 1.9622 2.9288 1.9990 1.4518 1.6105 1.5800 3.0351 3.0627 3.9500 2.5710 1.9838 3.3266 2.3675 3.3152 3.2761 2.8424 3.4122 3.7052 5.4626 1.1109 3.7221 2.4792 1.4284 2.4255 2.6967 2.6859 1.8225 2.1428 1.3117 3.4846 2.0008 1.6114 2.0288 1.9576 2.7602 1.8281 1.6748 2.1406 1.5513 1.4676 2.5679 1.3400 2.9349 1.5707 2.6476 1.2872 1.3221 1.4614 1.4458 1.4577 2.0513 1.5583 1.1927 1.4055 1.0736 1.7177 1.5366 1.5608 1.4715 1.3959 1.7715 1.3077 2.5424 1.6609 1.2426 1.1241 1.1451 1.0918 1.0526 1.0725 1.0907 1.0753 1.0659 1.0435 1.0779 1.0776 1.0824 8.0968 1.0716 1.0486 1.0598 1.0590 1.0583 1.0360 1.0612 1.0973 1.0610 1.1011 1.1043 1.0643 1.0871 1.0842 1.0873 1.1031 1.1028 1.0995 1.1009 1.0970 1.0913 1.1020
irintensity: 0.1085 0.0545 1.5906 0.6121 1.9894 0.5283 4.6359 0.4815 1.7905 0.6447 0.4642 5.3621 12.5196 2.6584 3.8578 0.7214 2.4886 0.3363 3.9224 12.6792 1.4606 1.9475 7.2482 12.1803 11.4541 20.4052 15.1291 5.6929 18.8172 2.2865 5.1923 13.5866 5.9700 5.2000 1.5670 5.8080 2.1394 8.4573 7.4039 6.3460 48.4233 2.0429 1.4052 1.5870 0.2820 13.5190 5.5553 68.1054 4.3173 17.2143 20.8616 0.7970 0.0169 4.6039 12.2908 16.2652 36.5087 0.0438 1.5610 0.2056 1.2126 24.3967 12.2298 7.6781 2.1220 43.9449 2.6060 148.2606 36.5706 27.9073 28.2057 3.1164 8.8148 21.2645 0.5795 16.6754 1.2262 5.1690 11.9994 10.2121 16.0810 8.1803 254.6405 74.1241 72.9597 8.7499 28.9315 71.5237 36.9861 29.5882 19.7414 27.7202 4.9303 29.8768 24.2506 52.3704 65.0538 67.7408 41.7192 11.7878 52.5343 97.8901 9.9456 23.3313 27.4690
temp: 298.150 k
press: 1.00000 atm
elementType: 8 7 7 6 6 6 6 6 6 6 6 6 6 6 6 1 1 1 1 1 1 1 1 1 1 1 1 1 1 1 1 1 1 1 1 1 1
symmnumber: 1
zpe: 858600.1 jmol-1
zpe.correction: 0.327024 hartree
zpe.thermalcorrener: 0.342828 hartree
zpe.thermalcorrenthalpy: 0.343772 hartree
zpe.thermalcorrgfe: 0.283141 hartree
zpe.sumelectzpe: -654.001511 hartree
zpe.sumelectthermal: -653.985706 hartree
zpe.sumelectthermalent: -653.984762 hartree
zpe.sumelectthermalfe: -654.045393 hartree
dipole: -1.3202 -3.6431 1.5377
dipole: 4.1689
quadrupole: -92.8211 -93.7433 -91.2284
quadrupole: -0.9813 0.2844 3.6222
quadrupole: -0.2235 -1.1457 1.3692 -0.9813 0.2844 3.6222
hfenergy: -654.3285342 hartree
pointgroup: C01 [X(C12H22N2O1)]
dipole: 0.5393818 1.4239673 0.6095465 debye
polarizability: 167.5396248|4.3310687|137.2938713|2.6563665|2.3611127|117.9395727 unknown
InChI: InChI=1S/C12H22N2O/c1-3-4-5-12(15)14-9-10-6-7-13(2)11(14)8-10/h10-11H,3-9H2,1-2H3
charge 0 multiplicity 1
37 atoms
O  -1.001706 -1.535737 -0.88632
N  0.431052 0.221815 -0.386717
N  2.417902 -1.1908 0.183477
C  2.304672 1.680094 -0.145779
C  1.682136 -0.480838 -0.879366
C  2.507614 0.732007 -1.357614
C  0.761126 1.603231 0.056742
C  3.085585 1.079763 1.055441
C  2.595403 -0.350003 1.396088
C  -0.827478 -0.353925 -0.443378
C  1.885202 -2.531826 0.515119
C  -1.988387 0.521641 0.055149
C  -3.355518 -0.178646 -0.054318
C  -4.514611 0.705817 0.456723
C  -5.887013 0.006787 0.346927
H  2.628338 2.717669 -0.337747
H  1.396342 -1.197925 -1.663592
H  2.078855 1.154111 -2.284739
H  3.561538 0.462526 -1.527002
H  0.472914 1.773505 1.112721
H  0.24445 2.35952 -0.568161
H  2.975351 1.716915 1.954002
H  4.16073 1.055141 0.795396
H  3.32318 -0.8470 2.064421
H  1.632457 -0.278166 1.963876
H  2.605787 -3.055952 1.169864
H  1.759965 -3.120701 -0.408613
H  0.897323 -2.498054 1.028558
H  -2.001718 1.471299 -0.520648
H  -1.794556 0.813327 1.10906
H  -3.534656 -0.465888 -1.107718
H  -3.324759 -1.12823 0.51275
H  -4.537206 1.655155 -0.117971
H  -4.327231 0.98695 1.514014
H  -5.901549 -0.929549 0.935829
H  -6.113004 -0.256957 -0.703378
H  -6.70383 0.653226 0.717602
