program: Gaussian 09
title: 000093801
version: EM64L-G09RevD.01
frameworkgroup: C1[X(C23H27BrF2O6)]
method: RPBEPBE
basis: SDD
operation: Freq
keyword: #p
keyword: freq=noraman
keyword: PBEPBE/SDD
title: #p freq=noraman PBEPBE/SDD
converged: NO YES NO NO
title: Mulliken charges:
elementType: Br F F O O O O O O C C C C C C C C C C C C C C C C C C C C C C C H H H H H H H H H H H H H H H H H H H H H H H H H H H
charge: 0.034322 -0.219897 -0.228430 -0.461710 -0.471744 -0.176372 -0.227122 -0.204275 -0.274363 0.355809 -0.100445 -0.268637 0.309787 0.112070 -0.656860 -0.538497 -0.233817 0.011897 -0.557810 -0.506076 -0.861580 -0.283412 0.659670 0.111668 -0.746639 -0.097540 -0.646503 -0.413728 -0.483426 0.292764 0.327689 -0.753080 0.287313 0.276366 0.283175 0.262377 0.223553 0.246912 0.253019 0.280570 0.212509 0.255718 0.247486 0.237840 0.264644 0.263071 0.239923 0.252682 0.282127 0.237405 0.300493 0.344296 0.371158 0.267018 0.286263 0.260231 0.252688 0.262502 0.244947
chargesum: 0.00000
title: Mulliken charges with hydrogens summed into heavy atoms:
elementType: Br F F O O O O O O C C C C C C C C C C C C C C C C C C C C C C C
charge: 0.034322 -0.219897 -0.228430 -0.117414 -0.100586 -0.176372 -0.227122 -0.204275 -0.274363 0.355809 0.186868 0.007730 0.309787 0.112070 -0.111308 -0.068032 0.019202 0.011897 -0.064731 -0.002871 -0.096025 -0.043489 0.659670 0.111668 0.025574 0.202953 -0.379485 0.132766 -0.483426 0.292764 0.327689 0.007057
polarizability: 3.55803355e+02 -1.27769777e+01 2.77969319e+02 -2.46541023e+01 -2.70421454e+00 2.09226085e+02
1716.lowfreq: -12.8014 -6.5589 -2.9441 -0.0008 -0.0006 -0.0002 22.0621 27.2919 30.9748
frequency: 21.8231 27.2257 30.8794 40.7529 50.3335 55.2102 63.2384 79.0189 83.7787 89.8615 105.4887 125.8352 127.8597 149.6368 161.4199 175.5035 192.5783 202.0215 208.9785 216.1484 217.8102 226.9904 235.0878 237.8402 247.8380 253.9459 270.7020 277.3866 280.8173 285.1558 300.1603 313.9524 319.3672 326.7766 339.2287 341.0860 349.9637 380.2324 391.2470 393.3320 413.1806 425.8911 434.6789 451.7304 464.9673 491.1784 521.7855 529.2562 538.3705 556.1261 565.9309 574.0585 580.6383 588.9673 618.9957 636.0374 649.8236 676.7208 699.4226 728.2461 741.7227 757.3183 767.3325 782.2941 792.6716 802.3217 816.4773 851.8624 855.3290 875.0887 888.2459 897.4330 899.6841 904.7948 920.3528 935.4246 945.5956 955.0162 964.2346 975.5222 980.5247 984.2904 1004.5444 1012.4531 1013.9370 1025.0364 1033.3469 1040.2478 1043.7081 1051.5664 1075.9430 1094.7866 1100.1368 1110.3945 1118.7287 1139.5258 1144.6479 1152.8172 1163.8840 1165.6617 1198.0016 1198.5709 1203.1719 1209.6182 1216.4887 1226.1972 1233.5669 1236.9685 1261.8500 1278.4486 1281.9629 1282.7442 1285.7337 1299.8181 1306.9031 1311.8390 1322.9645 1328.6034 1329.4754 1339.7772 1351.1342 1354.4760 1362.3261 1370.4531 1385.5924 1388.1041 1395.8982 1409.2691 1414.2752 1443.7036 1452.4481 1452.6690 1463.4231 1471.0902 1475.3308 1481.8962 1483.2674 1486.0491 1504.9253 1567.6183 1604.3505 1626.0595 1639.6765 1655.9366 2966.1674 2981.4127 2983.2381 2989.5197 3001.8978 3004.3799 3005.4295 3008.4608 3013.3357 3022.5114 3044.4537 3047.4190 3058.2339 3061.7224 3068.3797 3075.5545 3093.1362 3101.9455 3110.0068 3110.9973 3112.2519 3132.4724 3141.5749 3143.5616 3144.5150 3561.8287 3568.4270
redmass: 5.3760 7.4918 6.9635 1.1254 9.7935 6.3024 5.2729 4.4734 5.8836 5.1874 6.7613 3.4171 4.4867 4.7753 6.4765 5.3559 5.3211 3.5303 4.1432 4.8841 4.6582 5.7364 3.9844 1.4530 1.3895 1.6348 2.8808 3.4654 3.5086 2.6239 3.5400 5.4024 4.2279 3.8588 1.3389 3.0677 2.9780 3.4580 3.6585 2.9993 3.3779 4.2190 3.7294 2.8972 3.9703 4.1397 4.5501 3.4889 3.8243 5.3026 3.2414 3.3090 4.9743 5.2582 5.0002 5.3323 4.9875 3.0651 4.9973 4.7591 4.3548 4.8011 4.3513 2.4126 3.3802 3.7828 3.0850 3.1477 2.7370 2.9469 2.7047 2.1116 2.9091 2.3464 1.6265 2.1871 2.2367 2.5685 2.4167 1.9746 2.4506 2.6072 2.1404 3.1389 4.1553 2.2297 3.4232 2.1583 1.6575 2.5015 2.2860 3.3246 2.3240 2.2772 2.3606 2.0372 2.2978 2.3026 1.9871 2.3241 1.4074 2.5955 1.7524 1.3419 1.7826 1.7111 1.4275 1.7351 1.4210 1.4544 1.3905 1.3875 1.4773 1.3960 1.3907 1.6565 2.0172 1.5661 1.4969 1.4033 1.3519 2.0392 1.3629 1.4822 1.2366 1.3382 1.4127 1.1850 1.1032 1.0821 1.0601 1.0562 1.0644 1.0621 1.0747 1.0797 1.0570 1.0850 1.0547 10.9725 9.5026 9.6102 9.5307 8.2380 1.0812 1.0813 1.0684 1.0652 1.0618 1.0563 1.0445 1.0383 1.0360 1.0817 1.0579 1.0877 1.0981 1.0961 1.1009 1.1001 1.0987 1.0941 1.0980 1.1045 1.0977 1.0923 1.0942 1.1025 1.0996 1.0662 1.0664
irintensity: 0.8473 0.5377 0.2328 0.8481 1.1302 0.6686 0.1797 1.6779 0.9381 6.4816 2.6544 0.3596 1.3629 2.6012 0.1811 2.3965 2.2829 1.6365 6.9576 3.3425 1.0322 34.6533 11.6587 20.0189 45.5699 8.8161 11.6724 16.2193 13.4003 12.3376 13.6075 10.1664 1.9883 9.8979 99.2128 4.6584 9.8469 3.8883 6.9312 1.5042 18.4055 11.0790 8.9785 5.9430 5.4895 2.5508 3.5893 2.2521 9.2753 12.7348 2.5906 2.9348 14.8720 6.2428 1.2744 2.1918 6.6835 3.9469 15.9771 1.1729 2.7283 31.1075 10.4490 6.5809 9.7873 17.9862 0.1673 33.2314 8.1763 3.9132 49.0513 32.1030 62.9566 31.4159 27.0962 5.9251 17.2897 54.4192 39.7640 1.3352 1.5690 41.8694 1.6715 63.1295 25.8615 26.4568 29.9449 21.2614 10.1026 2.2866 8.4921 41.2198 14.2465 2.9632 33.8985 13.1586 16.3829 15.6817 35.3321 12.9286 18.6291 10.0135 107.3963 6.5681 3.0092 111.4929 4.0808 27.5107 3.9557 17.2145 8.9623 6.2210 7.6746 9.5628 12.7386 9.3372 20.9091 11.3411 32.3193 2.7962 6.7650 16.6202 1.6531 2.2597 58.1629 5.9323 29.7212 33.4582 26.9740 11.2631 32.0322 17.1480 4.2923 12.7067 5.9104 10.5049 16.0955 3.6836 7.4130 198.2380 49.2564 188.9833 115.6687 41.1091 26.4773 2.8293 24.5611 34.2089 13.7426 8.8560 22.0181 0.6256 12.1442 8.7671 7.7281 34.4640 13.8441 2.1630 12.5254 22.2917 9.7221 7.5373 13.8785 2.2863 14.6106 6.3605 0.3938 6.1818 5.2796 10.4947 9.4848
temp: 298.150 k
press: 1.00000 atm
elementType: 35 9 9 8 8 8 8 8 8 6 6 6 6 6 6 6 6 6 6 6 6 6 6 6 6 6 6 6 6 6 6 6 1 1 1 1 1 1 1 1 1 1 1 1 1 1 1 1 1 1 1 1 1 1 1 1 1 1 1
symmnumber: 1
zpe: 1209860.8 jmol-1
zpe.correction: 0.460812 hartree
zpe.thermalcorrener: 0.492683 hartree
zpe.thermalcorrenthalpy: 0.493627 hartree
zpe.thermalcorrgfe: 0.397644 hartree
zpe.sumelectzpe: -1554.696494 hartree
zpe.sumelectthermal: -1554.664623 hartree
zpe.sumelectthermalent: -1554.663678 hartree
zpe.sumelectthermalfe: -1554.759662 hartree
dipole: -9.0568 1.6964 -0.9986
dipole: 9.2683
quadrupole: -230.6122 -180.7953 -197.0141
quadrupole: 11.1551 14.9730 -13.4960
quadrupole: -27.8050 22.0119 5.7931 11.1551 14.9730 -13.4960
hfenergy: -1555.1573057 hartree
pointgroup: C01 [X(C23H27Br1F2O6)]
dipole: 3.3417889 1.3373011 0.5834858 debye
polarizability: 348.5132648|29.0129229|286.077357|-19.1189348|4.7451753|208.4081365 unknown
InChI: InChI=1S/C23H27BrF2O6/c1-11(27)32-10-19(30)22(31)5-4-12-13-6-16(25)14-7-17(28)15(24)8-21(14,3)23(13,26)18(29)9-20(12,22)2/h7-8,12-13,16,18,29,31H,4-6,9-10H2,1-3H3
charge 0 multiplicity 1
59 atoms
Br -4.703012 -4.101326 -0.096057
F  -1.676941 -0.20043 1.388372
F  -3.366219 2.643386 -1.662527
O  2.507949 0.835255 2.428469
O  -0.012025 -1.475391 -1.611082
O  4.848798 1.302464 -0.263633
O  5.724003 -1.176422 0.645026
O  -6.42098 -1.587453 0.725441
O  4.140291 -1.877501 -0.909231
C  1.596066 0.700699 0.132997
C  0.455169 1.673937 0.563579
C  -0.859156 1.434117 -0.20514
C  -1.302576 -0.048926 -0.057708
C  2.767461 1.281023 1.034527
C  1.155153 -0.73496 0.485425
C  1.105284 3.077909 0.490848
C  -0.183727 -1.131723 -0.184633
C  -2.646007 -0.343868 -0.845699
C  2.600288 2.823876 0.88496
C  -1.974018 2.37541 0.318842
C  1.983684 0.836385 -1.364308
C  -3.356789 2.092506 -0.272185
C  -3.701049 0.620121 -0.310197
C  4.152566 0.757066 0.627109
C  -2.496031 -0.12129 -2.400669
C  -3.043791 -1.799657 -0.679812
C  -4.902142 0.188903 0.171156
C  4.637497 -0.49853 1.378469
C  -4.24874 -2.201908 -0.19326
C  -5.288783 -1.240163 0.273677
C  5.338276 -1.811278 -0.540587
C  6.536146 -2.361449 -1.272126
H  0.253741 1.450545 1.631244
H  -0.70001 1.634879 -1.281072
H  1.031534 -0.811405 1.580447
H  1.920652 -1.476917 0.180437
H  0.617523 3.797997 1.170327
H  1.037355 3.492337 -0.532362
H  -0.570323 -2.026651 0.345814
H  3.296928 3.190073 0.111954
H  2.874661 3.33607 1.828227
H  -1.711628 3.426525 0.10245
H  -2.045098 2.26345 1.417409
H  2.402913 1.828772 -1.600083
H  2.74733 0.086162 -1.631986
H  1.110216 0.662827 -2.011971
H  -4.142784 2.664694 0.251743
H  -2.226068 0.918992 -2.634312
H  -1.733009 -0.802866 -2.801601
H  -3.470028 -0.325584 -2.877204
H  -2.320464 -2.527979 -1.063862
H  2.791484 1.552653 3.048966
H  0.882569 -1.884991 -1.726816
H  -5.659428 0.896197 0.532158
H  3.797453 -1.185427 1.569231
H  5.088642 -0.216945 2.34396
H  7.299119 -2.72106 -0.564372
H  6.99004 -1.551316 -1.871885
H  6.224435 -3.168917 -1.950882
