program: Gaussian 09
title: 000012263
version: EM64L-G09RevD.01
frameworkgroup: C1[X(C4H7NO2)]
method: RPBEPBE
basis: SDD
operation: Freq
keyword: #pfreq=noraman
keyword: PBEPBE/SDD
title: #p freq=noraman PBEPBE/SDD
converged: YES YES NO NO
title: Mulliken charges:
elementType: O O N C C C C H H H H H H H
charge: -0.182037 -0.181957 -0.398603 0.267012 0.266719 -0.793712 -0.794255 0.321253 0.272177 0.241993 0.233462 0.237332 0.238308 0.272306
chargesum: 0.00000
title: Mulliken charges with hydrogens summed into heavy atoms:
elementType: O O N C C C C
charge: -0.182037 -0.181957 -0.077349 0.267012 0.266719 -0.046080 -0.046308
polarizability: 7.10709328e+01 8.81869055e-04 6.30211993e+01 5.29002013e-02 -3.55230970e-02 3.55011722e+01
1716.lowfreq: -5.7287 0.0006 0.0010 0.0012 5.4171 9.4827 26.4314 40.0534 66.2904
frequency: 26.0664 39.7056 66.2675 126.8704 176.7243 335.8511 374.1650 496.0510 546.4219 605.0970 637.3509 672.3701 861.2843 885.7468 999.3555 1000.6459 1032.2364 1032.9736 1196.4415 1206.9362 1374.4611 1376.1480 1413.1690 1450.0444 1461.9782 1466.9451 1468.1393 1654.6985 1689.8551 2987.1715 2987.4115 3073.0820 3073.3837 3135.2524 3135.6673 3510.1259
redmass: 1.1946 1.1814 2.7496 3.1486 4.9443 3.6577 3.9855 3.9583 2.7698 2.8847 4.2624 1.1247 2.7998 4.3304 1.6973 2.5711 1.6911 1.7393 2.3486 4.2945 1.2372 1.2309 1.6034 1.0604 1.1513 1.0471 1.0528 4.8415 9.8127 1.0381 1.0381 1.0982 1.0982 1.0983 1.0983 1.0770
irintensity: 0.0165 0.0879 0.0055 0.0179 0.3133 0.8213 1.2652 21.8103 0.0007 4.9829 0.0389 91.7467 0.1800 9.8525 34.7432 1.8020 0.0560 19.9196 296.9043 0.0181 92.0213 43.4920 464.7482 27.3511 70.8476 19.5770 26.1639 7.7867 279.0830 0.6527 12.1034 0.2406 29.1167 9.0660 6.0540 8.8774
temp: 298.150 k
press: 1.00000 atm
elementType: 8 8 7 6 6 6 6 1 1 1 1 1 1 1
symmnumber: 1
zpe: 284568.2 jmol-1
zpe.correction: 0.108386 hartree
zpe.thermalcorrener: 0.116942 hartree
zpe.thermalcorrenthalpy: 0.117886 hartree
zpe.thermalcorrgfe: 0.073210 hartree
zpe.sumelectzpe: -361.288670 hartree
zpe.sumelectthermal: -361.280115 hartree
zpe.sumelectthermalent: -361.279171 hartree
zpe.sumelectthermalfe: -361.323846 hartree
dipole: 0.0003 -6.8089 0.0101
dipole: 6.8089
quadrupole: -38.0855 -46.0242 -40.8118
quadrupole: 0.0015 0.0813 -0.0154
quadrupole: 3.5550 -4.3837 0.8287 0.0015 0.0813 -0.0154
hfenergy: -361.3970568 hartree
pointgroup: C01 [X(C4H7N1O2)]
dipole: 0.0001333 2.6788102 -0.0057186 debye
dipolederiv: -0.6190937 0.0641678 -0.0002012 0.3533826 -0.8132298 0.0040741 0.0020335 0.0028795 -0.303166 -0.6190657 -0.0641671 -0.0005368 -0.3538124 -0.8128067 -0.0033004 -0.002261 -0.0027413 -0.3025965 -2.0750621 0.0004971 -0.0012844 -0.0004136 -0.4560922 -0.0019732 -0.0021453 0.0009031 -0.3783856 1.7744235 -0.077306 -0.0038734 -0.5317676 1.1058666 -0.0098322 -0.0117243 -0.0125842 0.2080632 1.7749017 0.0769714 0.0039619 0.5320014 1.1061079 0.0067717 0.0065086 0.0059185 0.2072604 -0.3220763 -0.1720013 0.0003363 -0.2602398 -0.2227563 0.0147759 0.0196855 0.026291 0.0520269 -0.3209683 0.1709597 -0.0001399 0.2616397 -0.2257914 -0.0022627 0.0016681 -0.0035729 0.053833 0.1670202 -0.0000529 -0.0008874 0.0001659 0.0690727 -0.0007969 -0.0008021 -0.0021934 0.3108408 -0.0427373 0.0388005 -0.0134921 0.0956772 0.0611462 0.0099173 -0.020219 0.0022382 0.1317147 0.0868313 -0.00376 -0.0466562 -0.017302 0.0500402 0.086562 -0.006611 0.1006455 -0.0439503 0.0763308 0.0188826 0.0625099 -0.003678 0.0125053 -0.1047517 0.015196 -0.1196112 -0.0111748 0.0810154 -0.0087478 0.0570401 0.0095401 0.029775 0.0984112 0.0126806 0.112985 -0.0261121 0.0825144 -0.0052786 -0.0548121 0.0115138 0.0351172 -0.0960374 -0.0110936 -0.1105051 -0.031201 -0.0440338 -0.0389652 -0.0019646 -0.0967073 0.0610453 -0.0015578 -0.002916 -0.0006527 0.1328474 unknown
polarizability: 71.0709723|-0.0009604|63.0211416|-0.0373524|-0.0533878|35.5011905 unknown
InChI: InChI=1S/C4H7NO2/c1-3(6)5-4(2)7/h5H,1-2H3
charge 0 multiplicity 1
14 atoms
O  1.458974 -1.285257 0.007692
O  -1.459038 -1.28551 -0.006975
N  -0.000125 0.57402 0.004999
C  1.283227 -0.046748 0.006371
C  -1.283423 -0.047034 -0.001591
C  2.426996 0.970398 -0.004963
C  -2.426783 0.970662 0.000071
H  -0.000406 1.598367 0.007418
H  3.379743 0.429223 0.0855
H  2.434135 1.543206 -0.951297
H  2.341352 1.689219 0.830959
H  -2.378146 1.62947 -0.887012
H  -2.392625 1.608041 0.903376
H  -3.381981 0.426544 -0.013847
