program: Gaussian 09
title: 000093604
version: EM64L-G09RevD.01
frameworkgroup: C1[X(C14H17N3O3)]
method: RPBEPBE
basis: SDD
operation: Freq
keyword: #p
keyword: freq=noraman
keyword: PBEPBE/SDD
title: #p freq=noraman PBEPBE/SDD
converged: NO YES NO NO
title: Mulliken charges:
elementType: O O O N N N C C C C C C C C C C C C C C H H H H H H H H H H H H H H H H H
charge: -0.263634 -0.201090 -0.206523 -0.106139 -0.071371 0.019093 -0.170201 -0.150831 -0.449937 -0.400574 -0.420144 -0.392440 -0.644791 0.116381 0.201748 0.232023 -0.313218 -0.377573 -0.231060 -0.208338 0.245150 0.286485 0.273963 0.215786 0.202414 0.215149 0.234045 0.207813 0.248535 0.222902 0.200874 0.235180 0.225776 0.257314 0.284155 0.240218 0.242857
chargesum: 0.00000
title: Mulliken charges with hydrogens summed into heavy atoms:
elementType: O O O N N N C C C C C C C C C C C C C C
charge: -0.263634 -0.201090 -0.206523 -0.106139 -0.071371 0.019093 0.074949 0.135654 0.039813 0.016989 0.021715 0.078996 0.017040 0.116381 0.201748 0.232023 -0.055905 -0.093418 0.009159 0.034519
polarizability: 2.46175878e+02 -2.24616534e+00 1.78738970e+02 -9.27040305e+00 6.85767356e+00 1.31673484e+02
1716.lowfreq: -6.3336 -0.0008 -0.0007 -0.0005 6.7340 10.5780 27.9761 41.1769 49.7492
frequency: 27.8659 41.1060 49.7321 70.4935 77.5174 82.9854 130.2844 144.7306 156.5854 194.4515 209.0540 234.2537 266.6582 288.9022 313.3096 334.7638 375.3429 388.3803 393.5287 414.7874 453.1376 463.4686 516.3664 531.7274 572.9917 619.1826 627.7732 652.3592 666.8778 699.3353 706.2875 750.2845 756.4576 783.0436 788.0334 804.7917 836.7474 847.8603 888.8513 891.4093 924.1112 931.6372 956.5642 972.0375 992.9839 998.8737 1011.2501 1026.8695 1033.9153 1058.0284 1076.7153 1083.7201 1098.9833 1111.9848 1134.2990 1139.6641 1144.1812 1167.1723 1175.1193 1181.5051 1201.3864 1215.0930 1223.4267 1233.2086 1262.7886 1271.6008 1293.2509 1302.2860 1314.3425 1314.7971 1343.4653 1348.5548 1357.3613 1366.8844 1382.0255 1413.0821 1427.6261 1441.0970 1455.5441 1459.5988 1466.5599 1467.0396 1469.9484 1485.0975 1498.4329 1555.4877 1574.7096 1606.2438 2874.8317 2902.4366 2989.5938 2992.9673 3003.9537 3010.4275 3011.6236 3046.8381 3056.3246 3075.8691 3083.2831 3088.2359 3095.8039 3140.1262 3154.1450 3167.8763 3184.2451
redmass: 5.8684 4.6522 7.1037 4.5166 5.8061 3.1400 4.0064 7.1912 1.3700 2.5698 4.7473 3.5246 5.3401 2.5475 2.7544 6.3860 2.2573 5.0424 2.9780 3.9672 3.5993 4.1025 3.6923 4.6694 3.6107 5.6440 4.8676 6.7936 5.3054 6.0118 5.7877 2.2696 3.3960 1.7245 4.4345 2.8066 4.6815 3.5675 2.0960 1.5443 2.3405 2.1285 1.6781 1.3894 1.9598 1.3435 2.1916 2.2189 2.6352 3.4088 1.5111 1.5087 1.7796 1.3368 2.0408 1.5811 1.4761 1.7707 1.0993 1.6602 2.0671 8.7872 2.0406 1.6060 1.5995 1.8815 1.3550 1.7965 1.5494 1.4041 1.5289 1.5011 1.4951 7.0053 5.5297 3.4968 2.4756 1.1619 1.0889 1.1073 1.2687 1.8450 1.0947 1.0645 1.0815 10.0067 6.4742 7.0418 1.0552 1.0680 1.0882 1.0658 1.0647 1.0649 1.0754 1.0875 1.1004 1.0975 1.1005 1.0905 1.1031 1.0866 1.0914 1.0961 1.0979
irintensity: 0.8473 2.1561 1.5913 2.7785 1.7454 1.3128 0.1035 2.4625 0.1662 6.6844 0.1036 3.0419 1.2302 1.8914 2.6706 9.2590 0.7608 3.7661 3.0952 2.1352 7.9923 5.6503 1.4153 3.0173 12.0467 6.4438 2.2221 9.4764 19.7596 1.7460 11.4402 4.8765 11.3295 46.3795 23.2048 3.2914 13.2669 19.4439 30.1217 1.4570 10.4958 8.8036 8.9629 3.3092 47.5468 0.7879 74.1663 4.2113 1.2186 7.9663 2.1572 60.5757 5.5262 16.2350 6.6474 6.2623 14.5900 15.5076 3.6352 37.9481 24.4524 212.3590 45.1745 39.4947 11.7013 22.2276 0.5805 5.8160 5.0401 17.9611 8.1663 7.1696 49.8452 136.8896 3.0782 165.5364 3.0322 1.4339 7.1114 8.8612 12.7406 15.6386 11.2415 5.9007 6.7014 377.1821 21.0361 6.4274 154.6555 142.1854 24.8899 44.4399 28.4936 19.2288 61.7607 62.8694 25.1471 27.3993 25.7547 7.2125 24.7589 1.2989 8.4697 11.6892 8.7197
temp: 298.150 k
press: 1.00000 atm
elementType: 8 8 8 7 7 7 6 6 6 6 6 6 6 6 6 6 6 6 6 6 1 1 1 1 1 1 1 1 1 1 1 1 1 1 1 1 1
symmnumber: 1
zpe: 776979.7 jmol-1
zpe.correction: 0.295936 hartree
zpe.thermalcorrener: 0.313622 hartree
zpe.thermalcorrenthalpy: 0.314567 hartree
zpe.thermalcorrgfe: 0.249204 hartree
zpe.sumelectzpe: -932.043637 hartree
zpe.sumelectthermal: -932.025950 hartree
zpe.sumelectthermalent: -932.025006 hartree
zpe.sumelectthermalfe: -932.090368 hartree
dipole: -1.7669 -3.3894 -4.5371
dipole: 5.9325
quadrupole: -97.2381 -117.9959 -123.7424
quadrupole: -11.7721 -7.8233 -0.0393
quadrupole: 15.7540 -5.0038 -10.7502 -11.7721 -7.8233 -0.0393
hfenergy: -932.3395726 hartree
pointgroup: C01 [X(C14H17N3O3)]
dipole: -0.6746119 1.5916589 1.568206 debye
polarizability: 245.9304665|1.3138167|179.557664|11.1934591|-0.1792504|131.1002016 unknown
InChI: InChI=1S/C14H17N3O3/c1-15-9-10-6-7-16(13(15)8-10)14(18)11-4-2-3-5-12(11)17(19)20/h2-5,10,13H,6-9H2,1H3
charge 0 multiplicity 1
37 atoms
O  0.187422 0.193121 -2.154799
O  3.071119 -2.726285 -0.040468
O  0.859846 -2.180014 -0.006817
N  -3.333211 0.885467 -0.127148
N  -0.965508 0.327816 -0.129805
N  2.113705 -1.862777 0.0057
C  -3.109431 -1.217556 0.985089
C  -2.295833 0.087989 -0.797423
C  -2.684935 -1.382646 -0.501126
C  -4.021647 0.039242 0.885897
C  -1.830489 -0.967399 1.834951
C  -1.036712 0.281179 1.348041
C  -4.134005 1.837164 -0.89964
C  0.178524 0.308086 -0.883011
C  1.507115 0.574022 -0.186926
C  2.469073 -0.42654 0.109423
C  1.905726 1.923517 -0.013888
C  3.778576 -0.116716 0.541187
C  3.201871 2.253065 0.436949
C  4.144313 1.23196 0.709574
H  -3.662995 -2.087097 1.379251
H  -2.176502 0.328771 -1.864784
H  -1.846495 -2.081371 -0.651543
H  -3.538743 -1.690342 -1.132987
H  -5.043284 -0.254617 0.548292
H  -4.123433 0.568469 1.854414
H  -1.184569 -1.862187 1.765768
H  -2.093485 -0.819739 2.900207
H  -1.549287 1.199234 1.690821
H  -0.015883 0.275622 1.763896
H  -4.923681 1.353908 -1.525661
H  -3.47992 2.426349 -1.565532
H  -4.638331 2.548041 -0.218227
H  1.1895 2.716525 -0.253093
H  4.476925 -0.934055 0.739851
H  3.480078 3.304425 0.565619
H  5.152987 1.485368 1.050448
