program: Gaussian 09
title: 000093534
version: EM64L-G09RevD.01
frameworkgroup: C1[X(C12H12N4)]
method: RPBEPBE
basis: SDD
operation: Freq
keyword: #pfreq=noraman
keyword: PBEPBE/SDD
title: #p freq=noraman PBEPBE/SDD
converged: NO YES NO NO
title: Mulliken charges:
elementType: N N N N C C C C C C C C C C C C H H H H H H H H H H H H
charge: -0.236772 -0.090904 -0.381482 -0.023972 0.320963 -0.148509 0.378856 0.176897 -0.086881 -0.361954 -0.334481 -0.666813 -0.336173 -0.188889 -0.379889 -0.603714 0.224100 0.254979 0.240001 0.252514 0.239888 0.273107 0.317950 0.223312 0.233404 0.203561 0.250485 0.250415
chargesum: 0.00000
title: Mulliken charges with hydrogens summed into heavy atoms:
elementType: N N N N C C C C C C C C C C C C
charge: -0.236772 -0.090904 -0.063532 -0.023972 0.320963 -0.148509 0.378856 0.176897 -0.086881 -0.137853 -0.079502 0.065590 -0.063066 0.034423 -0.146485 0.100747
polarizability: 2.58102873e+02 7.95394959e+00 1.73908076e+02 -5.69220975e-03 -2.40101732e-03 7.06047739e+01
1716.lowfreq: -128.7461 -0.0008 0.0006 0.0010 2.6820 4.2151 10.4279 46.5360 76.6859
frequency: -128.7285 46.5210 76.6842 83.6009 121.7067 130.2803 155.3025 197.8030 219.4062 222.9713 288.0152 290.4648 355.6279 358.4039 425.7618 438.9957 508.0381 518.1342 555.7665 572.3455 627.6682 639.0559 681.1210 697.3526 714.3456 764.2481 779.1681 819.4880 829.2696 836.1508 879.5048 937.6058 947.1770 968.1875 989.8917 1019.9870 1049.3561 1072.6860 1119.4567 1128.6632 1132.1071 1140.5635 1149.3395 1188.0645 1213.1442 1234.0124 1252.5471 1299.1902 1341.4010 1352.0928 1373.9537 1396.3305 1419.1206 1437.6018 1442.9963 1453.4314 1456.5010 1475.2652 1475.9115 1489.9948 1501.3064 1511.7690 1563.7323 1588.0203 1593.3237 1632.8505 2966.9032 2982.0714 3040.2793 3059.8591 3103.2774 3108.2731 3115.2952 3127.0349 3143.5945 3165.6846 3171.7126 3615.2497
redmass: 1.0858 1.0361 4.1970 3.0162 2.1346 3.5573 2.4699 2.5548 3.2781 2.8489 5.8256 3.4938 5.6192 5.5803 3.7438 5.3839 5.8129 4.3903 6.6961 3.1966 4.9219 7.0733 7.7455 4.6585 3.6364 6.7682 1.7262 1.4818 4.3345 3.7354 4.8615 1.4164 1.3395 4.1459 1.3577 2.7482 2.7961 2.5050 1.3064 1.2426 1.2749 1.7122 1.7498 2.0963 2.5462 2.2394 2.9132 3.5495 4.3360 3.2138 2.3347 2.4076 2.7713 1.2164 1.6207 1.0395 2.5414 1.5237 1.0422 1.2511 1.2130 3.5159 6.0613 7.0217 6.2908 8.3798 1.0369 1.0341 1.1022 1.1016 1.1009 1.0962 1.0889 1.0897 1.0897 1.0997 1.0948 1.0778
irintensity: 38.6465 0.0569 2.5824 3.3067 2.4626 0.8074 50.0051 25.2113 4.4443 10.6449 3.6229 2.1981 1.5499 0.7557 0.5654 1.8622 5.0376 0.0192 3.7064 8.1299 16.1310 5.3623 4.0069 4.4184 10.8853 2.0502 2.2923 101.5279 1.7125 0.2002 0.3938 0.0568 0.9317 27.9302 1.4153 0.1078 19.5488 7.0913 0.2616 6.5985 1.5141 4.8102 11.2309 35.7036 8.3431 1.8081 31.3739 17.0620 0.3249 50.1522 106.3511 3.1016 1.7795 40.5485 2.8941 12.9127 32.5540 66.2838 14.7980 7.5381 5.3718 6.6329 38.4562 50.0924 501.2754 220.0114 78.5592 84.1029 27.7724 32.4727 25.4034 7.6284 26.0941 14.4656 15.2360 26.2398 8.0456 67.3192
temp: 298.150 k
press: 1.00000 atm
elementType: 7 7 7 7 6 6 6 6 6 6 6 6 6 6 6 6 1 1 1 1 1 1 1 1 1 1 1 1
symmnumber: 1
zpe: 578873.1 jmol-1
zpe.correction: 0.220481 hartree
zpe.thermalcorrener: 0.233875 hartree
zpe.thermalcorrenthalpy: 0.234819 hartree
zpe.thermalcorrgfe: 0.180065 hartree
zpe.sumelectzpe: -682.371825 hartree
zpe.sumelectthermal: -682.358431 hartree
zpe.sumelectthermalent: -682.357486 hartree
zpe.sumelectthermalfe: -682.412241 hartree
dipole: 7.1593 0.7895 0.0012
dipole: 7.2027
quadrupole: -74.5540 -82.6162 -98.2379
quadrupole: 10.9578 0.0038 0.0007
quadrupole: 10.5820 2.5198 -13.1018 10.9578 0.0038 0.0007
hfenergy: -682.5923058 hartree
pointgroup: C01 [X(C12H12N4)]
dipole: -2.813787 0.3358976 -0.0004774 debye
polarizability: 257.9531354|-8.7091934|174.0578137|-0.0056704|0.0024521|70.6047739 unknown
InChI: InChI=1S/C12H12N4/c1-13-12-15-11-8-4-3-7-14-9(8)5-6-10(11)16(12)2/h3-7,13H,1-2H3
charge 0 multiplicity 1
28 atoms
N  -2.113916 1.022272 0.000126
N  -1.298764 -1.132865 0.000158
N  -3.698138 -0.83098 0.000331
N  3.455276 0.520937 -0.000106
C  -0.702716 1.126151 0.000065
C  -0.2283 -0.216528 0.000072
C  1.176909 -0.476629 0.000018
C  -2.405471 -0.356498 0.000185
C  2.072892 0.670505 -0.000041
C  0.164131 2.249158 0.000067
C  1.543232 2.007619 -0.000012
C  -3.085589 2.113504 -0.000451
C  1.751847 -1.783835 0.000017
C  3.144018 -1.914478 -0.00006
C  3.952804 -0.733148 -0.000125
C  -3.956962 -2.274886 -0.0001
H  -0.21723 3.276717 0.000154
H  2.265546 2.828864 -0.000019
H  -3.726185 2.086129 0.902223
H  -2.549425 3.074992 -0.002397
H  -3.727808 2.083516 -0.901889
H  1.087919 -2.654219 0.000062
H  -4.47646 -0.176909 0.000258
H  3.621915 -2.899615 -0.000082
H  5.047024 -0.815656 -0.000179
H  -5.046476 -2.445213 0.000438
H  -3.513909 -2.756299 0.890713
H  -3.514863 -2.755706 -0.891724
