program: Gaussian 09
title: 000093548
version: EM64L-G09RevD.01
frameworkgroup: C1[X(C13H15BrO4S)]
method: RPBEPBE
basis: SDD
operation: Freq
keyword: #p
keyword: freq=noraman
keyword: PBEPBE/SDD
title: #p freq=noraman PBEPBE/SDD
converged: YES YES NO NO
title: Mulliken charges:
elementType: Br S O O O O C C C C C C C C C C C C C H H H H H H H H H H H H H H H
charge: 0.041010 0.849220 -0.539575 -0.520895 -0.242852 -0.244063 -0.021366 -0.471702 -0.475643 -0.430400 -0.425540 0.223507 -0.058204 -0.205976 -0.262596 -0.170725 -0.160432 -0.499072 -0.213381 0.245600 0.270285 0.250289 0.284071 0.231425 0.215509 0.229432 0.234690 0.298030 0.301732 0.264064 0.263644 0.236433 0.242065 0.261417
chargesum: 0.00000
title: Mulliken charges with hydrogens summed into heavy atoms:
elementType: Br S O O O O C C C C C C C C C C C C C
charge: 0.041010 0.849220 -0.539575 -0.520895 -0.242852 -0.244063 -0.021366 0.044184 0.058717 0.016534 0.038581 0.223507 -0.058204 0.092054 0.039136 0.093339 0.103212 0.240842 -0.213381
polarizability: 2.78582243e+02 -3.63866302e+00 1.77057240e+02 9.08966822e+00 1.06018574e+01 1.42542559e+02
1716.lowfreq: -12.0367 -4.1383 0.0012 0.0015 0.0019 5.9430 18.9051 32.8311 35.0791
frequency: 17.6945 32.5507 34.3093 46.5448 58.4424 92.6448 97.9702 111.0901 116.4009 153.3811 169.3480 182.2126 186.4564 202.0804 213.6490 235.9720 253.9334 277.7202 301.1120 319.8708 338.8773 357.1438 404.0067 406.9761 443.6638 468.8778 489.6023 514.5358 564.3237 610.4682 662.0204 685.8097 704.2519 707.9819 754.0847 795.3198 816.0245 828.8351 843.1862 859.6599 894.7353 907.3486 909.4565 922.0427 960.2737 963.0370 976.9886 982.6634 1019.9821 1043.3517 1052.2341 1055.8238 1059.8332 1108.7514 1114.6988 1141.1103 1144.6696 1156.6338 1160.7082 1183.1889 1216.5586 1233.2474 1255.8781 1285.8159 1287.6087 1299.9813 1313.3044 1326.8773 1373.4173 1375.5242 1419.1766 1443.0415 1448.0731 1451.9885 1461.9062 1463.9806 1474.4364 1482.2966 1561.2915 1586.0028 1596.4564 2995.6909 3001.4223 3009.6706 3010.3454 3012.1641 3067.6869 3070.0825 3077.8354 3088.3940 3117.4563 3151.6266 3157.2924 3166.0763 3176.6358 3182.7852
redmass: 5.3412 4.5043 3.7615 4.3288 4.5765 1.6350 9.3137 2.0644 7.4853 3.0201 6.1038 8.3886 4.3615 6.3530 7.2060 5.0489 2.3830 4.1239 4.7826 3.3919 9.2323 6.3381 7.5852 3.1884 5.3003 3.6199 5.9202 4.2935 2.1432 7.1003 2.6889 7.2747 4.1163 5.2871 3.8610 14.6325 2.0227 1.3582 1.3301 1.9923 6.3525 2.3072 1.5883 15.9746 1.4197 1.9039 5.2710 1.4496 3.1243 6.4414 1.5735 1.8744 1.8723 1.3648 1.2808 2.2683 2.4886 1.4267 1.9176 1.1343 1.5070 1.5869 1.7792 1.2303 1.2318 1.3042 1.4232 1.5993 5.0816 3.8597 1.2009 1.0790 2.0311 1.0509 1.0535 1.0772 1.0842 1.0969 5.9473 8.1105 9.4284 1.0662 1.0623 1.0387 1.0500 1.0644 1.0999 1.0981 1.0993 1.1048 1.1052 1.0899 1.1052 1.0893 1.0960 1.0979
irintensity: 1.2227 0.5830 0.9200 1.3027 3.0578 0.0965 2.2735 0.4756 1.4707 1.0121 0.7230 0.6908 13.3214 4.0441 0.8521 0.5166 11.8126 3.9853 30.1851 2.1132 26.1263 0.6063 11.4174 2.5872 14.1065 2.7142 18.9181 106.9187 1.7122 0.7914 1.8914 50.5661 4.1626 3.1712 10.8424 81.1319 3.9939 22.2679 31.6093 2.2963 4.2709 10.4191 0.8103 58.9257 1.0334 4.7949 57.9411 6.7303 29.2710 74.8434 0.8596 5.1408 20.1240 5.4701 2.6145 154.8244 3.0442 28.5081 33.6522 10.3335 26.4030 67.9007 77.8737 3.4718 2.0245 2.9259 5.5586 3.0423 3.0900 21.1692 23.9865 39.4483 50.3938 16.4354 4.9843 24.3641 11.8869 9.8298 41.5728 3.1669 128.7183 3.3704 39.2230 46.8206 7.3756 7.6251 10.9778 19.7178 9.0484 32.0158 16.3915 5.4658 14.8511 3.0404 1.6687 5.5993
temp: 298.150 k
press: 1.00000 atm
elementType: 35 16 8 8 8 8 6 6 6 6 6 6 6 6 6 6 6 6 6 1 1 1 1 1 1 1 1 1 1 1 1 1 1 1
symmnumber: 1
zpe: 668464.8 jmol-1
zpe.correction: 0.254605 hartree
zpe.thermalcorrener: 0.274810 hartree
zpe.thermalcorrenthalpy: 0.275754 hartree
zpe.thermalcorrgfe: 0.202708 hartree
zpe.sumelectzpe: -1215.215684 hartree
zpe.sumelectthermal: -1215.195479 hartree
zpe.sumelectthermalent: -1215.194535 hartree
zpe.sumelectthermalfe: -1215.267581 hartree
dipole: 0.7676 0.8287 -3.7122
dipole: 3.8802
quadrupole: -117.1901 -120.2838 -141.6371
quadrupole: -4.9529 -9.8955 -0.9241
quadrupole: 9.1803 6.0865 -15.2668 -4.9529 -9.8955 -0.9241
hfenergy: -1215.4702892 hartree
pointgroup: C01 [X(C13H15Br1O4S1)]
dipole: 0.5178675 -0.0675193 1.4344925 debye
polarizability: 267.0498756|25.0837382|185.7056247|-27.2256169|0.3780059|145.426542 unknown
InChI: InChI=1S/C13H15BrO4S/c1-18-12(15)13(8-2-3-9-13)19(16,17)11-6-4-10(14)5-7-11/h4-7H,2-3,8-9H2,1H3
charge 0 multiplicity 1
34 atoms
Br -5.630739 -1.080777 1.170258
S  0.41893 -0.076964 -1.306418
O  0.818855 -1.473686 -2.065388
O  0.361803 1.33016 -2.138012
O  2.764123 2.232669 -0.302928
O  0.902773 2.28269 1.098324
C  1.791002 0.133503 0.309897
C  1.241477 -0.660376 1.51083
C  3.078912 -0.553081 -0.181782
C  2.402938 -1.617325 1.902765
C  3.095182 -1.919512 0.549291
C  1.760862 1.639078 0.440763
C  -1.288345 -0.365199 -0.537445
C  -1.958028 0.722025 0.051208
C  -1.846399 -1.648523 -0.655507
C  -3.256967 0.503154 0.563242
C  -3.14785 -1.861587 -0.146608
C  2.689616 3.709709 -0.427786
C  -3.830141 -0.783936 0.459134
H  0.35737 -1.260446 1.221586
H  0.911593 0.017363 2.315814
H  3.939865 0.074722 0.112939
H  3.114403 -0.658842 -1.279859
H  2.036331 -2.522954 2.415911
H  3.106372 -1.103064 2.585005
H  4.117764 -2.31709 0.667122
H  2.50548 -2.654915 -0.028516
H  -1.489174 1.707898 0.117074
H  -1.285571 -2.448806 -1.149943
H  -3.807733 1.322684 1.032473
H  -3.617419 -2.845794 -0.224564
H  3.596396 3.989508 -0.980735
H  2.662306 4.178176 0.569898
H  1.781013 3.973938 -0.993145
