program: Gaussian 09
title: 000093513
version: EM64L-G09RevD.01
frameworkgroup: C1[X(C9H13NO3)]
method: RPBEPBE
basis: SDD
operation: Freq
keyword: #p
keyword: freq=noraman
keyword: PBEPBE/SDD
title: #p freq=noraman PBEPBE/SDD
converged: YES YES NO NO
title: Mulliken charges:
elementType: O O O N C C C C C C C C C H H H H H H H H H H H H H
charge: -0.425900 -0.377190 -0.259634 -0.134017 -0.411332 -0.381783 0.230528 -0.169780 -0.316021 0.005190 -0.774098 -0.317721 0.142139 0.224831 0.237895 0.219043 0.229130 0.230484 0.216653 0.186946 0.214838 0.251782 0.256140 0.248923 0.336781 0.336173
chargesum: 0.00000
title: Mulliken charges with hydrogens summed into heavy atoms:
elementType: O O O N C C C C C C C C C
charge: -0.089119 -0.041017 -0.259634 -0.134017 0.051394 0.066391 0.230528 0.060704 0.087579 0.005190 -0.051339 -0.068798 0.142139
polarizability: 1.60378686e+02 6.49981431e+00 1.17523300e+02 1.63696321e+01 1.47806474e+00 7.51959129e+01
1716.lowfreq: -5.2328 -1.5556 -0.0007 -0.0005 0.0004 11.7175 37.5603 41.9912 73.6251
frequency: 37.0681 41.9622 73.6137 81.8626 115.9926 127.3033 164.1007 217.1884 258.9411 276.7810 309.5226 316.8930 325.6547 349.5374 387.7883 438.0084 469.7234 501.1806 518.3857 551.9644 563.5560 643.3509 728.7466 770.0662 773.0889 813.0991 854.0369 864.8278 927.0828 967.2995 981.3185 1026.9654 1034.4540 1041.7041 1048.6012 1089.3149 1110.3877 1167.8383 1200.1423 1208.0574 1245.9971 1254.6671 1274.1335 1288.2114 1333.9611 1340.3665 1367.1833 1387.2643 1391.7277 1409.2953 1456.6944 1464.7845 1470.5418 1478.7406 1489.6440 1506.5554 1547.2628 1565.5907 1634.4995 2947.2389 2976.3583 2988.9068 3012.7769 3046.5113 3058.4328 3064.6977 3074.6495 3082.7653 3149.5359 3184.4890 3562.4309 3573.5521
redmass: 5.5829 4.9398 1.6944 1.8980 2.1042 3.5918 2.1475 3.9433 1.3639 3.7826 1.5437 2.8912 5.0394 2.8475 2.3314 3.8296 6.9577 5.2156 4.5485 3.9193 3.6211 6.1697 3.2224 2.0843 1.6309 1.8509 2.3637 1.2661 1.2860 4.7431 2.7433 2.8338 1.5141 1.7579 3.1949 1.7147 1.9357 1.2966 4.4377 1.6523 2.6187 1.4060 1.3698 1.0937 1.2866 2.0975 1.3339 1.2466 1.8099 1.2376 1.5167 1.7920 1.1116 1.1524 1.1084 1.1025 6.4404 6.4707 6.5446 1.0690 1.0394 1.0626 1.0639 1.0924 1.0965 1.0984 1.0979 1.1019 1.0889 1.0974 1.0664 1.0651
irintensity: 2.9341 7.3289 5.4640 10.3892 0.1431 1.0517 1.1642 1.0353 98.5619 15.9874 105.0890 77.5436 12.6364 10.1732 2.5925 11.9926 4.7505 5.0451 5.5748 2.9247 15.1702 4.5003 3.7918 15.9619 0.9712 50.1338 5.1186 5.7533 0.2085 76.9722 91.6744 10.1415 10.8863 15.2290 18.4240 25.9226 102.4602 14.9386 52.5398 88.7825 120.8338 15.2157 10.9767 0.6688 12.5270 16.8080 16.2820 27.6519 15.9504 7.8332 12.1062 15.5069 4.2657 11.1405 32.2053 3.7558 71.6031 92.9732 264.9723 64.8344 27.6404 10.0474 39.9624 13.9871 18.7159 6.5071 38.1108 36.1625 7.2025 5.5371 9.7291 16.5639
temp: 298.150 k
press: 1.00000 atm
elementType: 8 8 8 7 6 6 6 6 6 6 6 6 6 1 1 1 1 1 1 1 1 1 1 1 1 1
symmnumber: 1
zpe: 550323.3 jmol-1
zpe.correction: 0.209607 hartree
zpe.thermalcorrener: 0.223499 hartree
zpe.thermalcorrenthalpy: 0.224443 hartree
zpe.thermalcorrgfe: 0.168096 hartree
zpe.sumelectzpe: -630.144420 hartree
zpe.sumelectthermal: -630.130528 hartree
zpe.sumelectthermalent: -630.129584 hartree
zpe.sumelectthermalfe: -630.185931 hartree
dipole: 7.5150 1.1081 2.9833
dipole: 8.1611
quadrupole: -118.0691 -64.0907 -78.3096
quadrupole: -14.6714 -2.5462 1.7398
quadrupole: -31.2459 22.7324 8.5135 -14.6714 -2.5462 1.7398
hfenergy: -630.354027 hartree
pointgroup: C01 [X(C9H13N1O3)]
dipole: -2.9720352 0.3411334 -1.166164 debye
dipolederiv: -0.9083483 -0.140245 0.1289181 -0.1566996 -0.1845667 -0.0838988 0.24415 -0.101519 -0.6158089 -0.5066626 -0.5034363 0.0100027 -0.6616178 -0.8169859 -0.2039976 -0.0282651 -0.182153 -0.378541 -1.2786595 0.1752961 -0.2433416 0.1506681 -0.4202059 0.0419461 -0.2847587 0.0533278 -0.4473464 -1.0594239 0.1446114 -0.1422888 0.1181353 -0.5606748 0.004759 -0.323903 0.0484944 -0.2232298 0.7800627 -0.0374862 0.0595639 -0.0454662 0.1815143 -0.0013107 0.1020948 -0.0168345 0.2832558 -0.3476651 0.004722 0.0241062 0.0210748 0.1205683 -0.0275665 -0.0057821 0.0070334 -0.0608481 0.4330909 -0.1732285 0.1298731 0.37923 0.2819091 0.0829463 0.2283761 -0.0740226 -0.0210975 0.4922034 -0.3497191 0.1456829 -0.4746604 0.3621031 -0.0719069 0.1905853 -0.0915589 -0.0466672 0.677993 0.051768 -0.15389 0.059903 0.2964619 0.0233866 -0.0839535 0.0306627 0.532978 0.030077 0.6423171 -0.0041233 0.9821532 0.4554788 0.2624567 0.0105681 0.1949369 0.029255 0.0319741 0.0829579 0.0073846 -0.0186359 -0.0921404 -0.0073139 -0.0363754 0.0306535 0.1026933 -0.5703582 0.0947681 -0.0689709 -0.3419396 0.0062908 -0.0860725 -0.11546 0.0467045 -0.2453939 1.410868 -0.1716461 0.3603736 -0.1856913 0.3846107 -0.0492871 0.4104617 -0.0486864 0.2805478 -0.0038243 -0.010171 -0.0229833 -0.0795346 -0.0452057 -0.1374883 -0.0144373 -0.0609999 -0.0003633 -0.0019128 0.028858 -0.0057835 0.0705245 -0.0426322 0.1280135 0.0155951 0.0783156 0.0166827 0.0463615 0.0350224 -0.0012883 0.0114705 -0.0777318 0.1188293 -0.0237055 0.0719872 0.0067926 0.0536312 -0.0477976 -0.0316475 -0.0395597 -0.039996 -0.0991681 -0.0707311 -0.0817073 0.0010116 0.0052227 -0.111533 -0.0606488 -0.0844848 0.0149793 -0.0242743 -0.0612167 -0.0365714 0.1355294 0.0480008 0.0127301 0.0094924 0.0396908 -0.0666952 0.120438 -0.0048345 0.080368 -0.0132702 -0.0256288 -0.0259278 0.0155456 -0.0563186 -0.0885687 -0.172222 -0.0178212 -0.1156872 -0.1073942 0.004517 -0.1681504 -0.0829733 -0.0560045 -0.0160882 -0.045161 -0.0616883 -0.0844707 0.0638375 -0.1179313 0.0657331 0.0644354 0.0232985 0.0999011 0.0271387 0.0755428 0.0058484 0.0604435 0.0701858 0.0440929 -0.0340959 0.0669961 0.0311584 0.0371839 -0.05067 0.0868675 -0.0914912 0.073927 0.0495045 -0.0245365 0.0244066 -0.0403828 -0.0031435 -0.0374734 0.0019665 0.1594903 0.3891119 0.1313233 -0.0263637 0.1186514 0.0653704 0.1177929 -0.0060671 0.0936869 0.2549809 0.2731878 0.1756363 -0.0524432 0.1344101 0.1915281 0.0479202 -0.0502311 0.0633576 0.3239534 unknown
polarizability: 160.8235577|-5.1539432|117.1730668|16.0323623|-2.3583092|75.1012741 unknown
InChI: InChI=1S/C9H13NO3/c1-7-9(13)8(12)3-5-10(7)4-2-6-11/h3,5,11,13H,2,4,6H2,1H3
charge 0 multiplicity 1
26 atoms
O  -4.931355 -0.038236 1.081032
O  2.784518 1.747446 0.363777
O  3.759318 -0.807226 0.650014
N  -0.197621 -0.280427 -0.595788
C  -1.636773 -0.172328 -0.940628
C  -2.562071 -0.197525 0.300541
C  0.588468 0.857409 -0.297682
C  0.350046 -1.551054 -0.468554
C  -4.050535 -0.110313 -0.091186
C  1.917302 0.682638 0.090099
C  -0.050941 2.224566 -0.449941
C  1.651029 -1.757623 -0.062416
C  2.551183 -0.65239 0.26493
H  -1.884315 -1.019123 -1.607762
H  -1.808267 0.748325 -1.524121
H  -2.3753 -1.129633 0.870969
H  -2.323277 0.643834 0.977171
H  -0.319788 -2.379128 -0.718926
H  -4.256176 0.825759 -0.639155
H  -4.329041 -0.963502 -0.748538
H  0.533296 3.003163 0.071569
H  -1.058458 2.263788 -0.000961
H  -0.135709 2.533802 -1.509582
H  2.046443 -2.77385 0.015383
H  -4.834266 -0.867979 1.613379
H  2.368491 2.622406 0.162675
