program: Gaussian 09
title: 000093518
version: EM64L-G09RevD.01
frameworkgroup: C1[X(C11H12O4S)]
method: RPBEPBE
basis: SDD
operation: Freq
keyword: #p
keyword: freq=noraman
keyword: PBEPBE/SDD
title: #p freq=noraman PBEPBE/SDD
converged: YES YES NO NO
title: Mulliken charges:
elementType: S O O O O C C C C C C C C C C C H H H H H H H H H H H H
charge: 0.873621 -0.553982 -0.518490 -0.277666 -0.231279 -0.187274 -0.486805 -0.469380 0.325315 -0.032334 -0.212581 -0.270246 -0.223380 -0.210575 -0.497329 -0.216201 0.292205 0.270497 0.281677 0.302597 0.300451 0.291317 0.241267 0.240335 0.237162 0.243873 0.251298 0.235907
chargesum: 0.00000
title: Mulliken charges with hydrogens summed into heavy atoms:
elementType: S O O O O C C C C C C C C C C C
charge: 0.873621 -0.553982 -0.518490 -0.277666 -0.231279 -0.187274 0.075896 0.114894 0.325315 -0.032334 0.087869 0.021072 0.017888 0.029760 0.235004 0.019706
polarizability: 1.80483197e+02 1.59285566e+01 1.51089452e+02 -1.09934510e+01 1.49461977e+01 1.22028333e+02
1716.lowfreq: -0.0028 -0.0023 -0.0023 6.2826 8.7894 12.8441 24.3501 43.1917 50.7663
frequency: 24.2684 43.1836 50.7157 79.8263 97.7333 120.9768 135.8330 148.8147 175.8356 207.2388 235.2808 241.3409 246.1083 256.3835 302.8877 312.5944 360.8115 396.1036 404.9718 443.8684 485.5390 517.8522 603.0805 640.2597 659.2301 688.2473 699.1444 757.2612 761.8698 775.3365 794.5980 848.4499 874.8957 906.8342 932.4356 934.1430 952.3933 959.2948 976.3744 983.1075 1003.0827 1008.0817 1049.9014 1062.6943 1079.5858 1089.7702 1095.9091 1111.9168 1145.6205 1172.1458 1172.8674 1182.2225 1192.9780 1308.1266 1320.1485 1383.6017 1403.9702 1422.8879 1429.5748 1436.7661 1452.1919 1454.7441 1463.2304 1577.5486 1603.0941 1630.5800 3008.9198 3100.2665 3106.3669 3113.8761 3136.0692 3148.7155 3154.3530 3159.2656 3170.3737 3186.6171 3211.3243 3229.6955
redmass: 4.2055 5.3527 4.6527 3.2614 1.2918 4.7471 3.8685 6.5941 5.4932 5.6892 4.7730 3.6129 9.1840 3.4771 4.1334 5.8929 8.2571 6.9640 2.8415 8.1739 4.9174 6.3685 6.4698 3.5188 6.8109 2.2853 7.0374 3.0785 1.4870 1.4338 5.2842 1.2484 7.3176 7.9569 8.6661 1.4153 3.0267 1.3101 2.8146 1.9052 1.3374 4.4853 2.0580 1.2434 1.5837 2.5665 1.3388 1.2612 1.4287 1.2894 1.0613 1.1251 3.0015 1.3035 3.8878 8.3139 1.0857 1.2192 1.2392 2.2502 1.0497 2.0029 1.0521 5.7794 6.9335 10.6222 1.0292 1.0528 1.0586 1.1050 1.0859 1.0893 1.1052 1.0941 1.0991 1.0967 1.1172 1.1158
irintensity: 0.4114 1.8000 1.3784 0.7719 0.4507 0.8033 2.6728 0.8205 6.8376 2.7328 6.0256 6.2009 1.3094 6.1430 26.7513 7.9773 2.4317 13.2120 0.0755 47.3454 18.2395 90.9560 0.1598 11.2146 12.9878 41.8448 8.1826 2.5591 76.9574 5.0237 52.4101 0.4580 1.4262 17.2522 89.1490 2.6340 5.8089 6.7559 0.9116 1.2749 0.0513 1.9178 30.6503 71.0898 8.0280 245.5300 12.7702 0.4014 14.3657 0.3274 0.5719 8.4008 54.5554 2.0373 103.6094 6.6193 20.2479 22.4326 18.3647 16.6579 14.9462 16.3730 13.1508 1.9710 1.7694 155.1149 30.4793 2.8885 2.4727 20.3025 1.6510 12.2177 12.6019 5.2578 21.1430 11.3484 0.5472 0.1563
temp: 298.150 k
press: 1.00000 atm
elementType: 16 8 8 8 8 6 6 6 6 6 6 6 6 6 6 6 1 1 1 1 1 1 1 1 1 1 1 1
symmnumber: 1
zpe: 544385.9 jmol-1
zpe.correction: 0.207346 hartree
zpe.thermalcorrener: 0.223757 hartree
zpe.thermalcorrenthalpy: 0.224701 hartree
zpe.thermalcorrgfe: 0.162184 hartree
zpe.sumelectzpe: -1123.938366 hartree
zpe.sumelectthermal: -1123.921955 hartree
zpe.sumelectthermalent: -1123.921011 hartree
zpe.sumelectthermalfe: -1123.983528 hartree
dipole: -1.1260 3.9863 -4.8575
dipole: 6.3838
quadrupole: -77.4570 -101.7895 -106.9207
quadrupole: 0.8796 -2.0491 5.1876
quadrupole: 17.9320 -6.4004 -11.5317 0.8796 -2.0491 5.1876
hfenergy: -1124.1457117 hartree
pointgroup: C01 [X(C11H12O4S1)]
dipole: 0.2310572 -1.8144655 1.7211799 debye
polarizability: 187.1059423|-3.9132528|141.2154904|-2.3980156|20.0188215|125.2795488 unknown
InChI: InChI=1S/C11H12O4S/c1-15-10(12)11(7-8-11)16(13,14)9-5-3-2-4-6-9/h2-6H,7-8H2,1H3
charge 0 multiplicity 1
28 atoms
S  -0.263859 1.229085 -0.614212
O  -0.295391 2.711063 0.096578
O  -0.659033 1.0497 -2.18298
O  -2.737333 -1.810382 0.684611
O  -0.883007 -1.826992 -0.72872
C  -1.513613 0.211514 0.467297
C  -1.596772 0.651317 1.939459
C  -2.695059 1.054783 0.96392
C  -1.644002 -1.213831 0.053895
C  1.475244 0.53124 -0.310059
C  1.91448 -0.54847 -1.092626
C  2.27372 1.204335 0.628864
C  3.241499 -0.995033 -0.892859
C  3.59622 0.737854 0.814912
C  -2.950146 -3.245869 0.365265
C  4.074035 -0.358592 0.058789
H  -0.905386 1.443674 2.24343
H  -1.783565 -0.144329 2.664979
H  -3.659561 0.544237 0.996138
H  -2.697188 2.102866 0.647745
H  1.246045 -1.016198 -1.819921
H  1.880351 2.074666 1.164151
H  3.621803 -1.835816 -1.482084
H  4.250479 1.236728 1.537464
H  -3.842846 -3.529231 0.939543
H  -2.071939 -3.837849 0.672323
H  -3.114469 -3.370279 -0.717632
H  5.101294 -0.71079 0.20373
