program: Gaussian 09
title: 000012254
version: EM64L-G09RevD.01
frameworkgroup: C1[X(C3H8N2O)]
method: RPBEPBE
basis: SDD
operation: Freq
keyword: #pfreq=noraman
keyword: PBEPBE/SDD
title: #p freq=noraman PBEPBE/SDD
converged: NO YES NO NO
title: Mulliken charges:
elementType: O N N C C C H H H H H H H H
charge: -0.302669 -0.375177 -0.665943 -0.325856 -0.635046 0.292083 0.209357 0.209355 0.282196 0.243272 0.243330 0.193218 0.293873 0.338005
chargesum: 0.00000
title: Mulliken charges with hydrogens summed into heavy atoms:
elementType: O N N C C C
charge: -0.302669 -0.092980 -0.034065 0.092857 0.044775 0.292083
polarizability: 6.27880524e+01 3.97081957e-01 5.40088468e+01 -5.72804076e-03 4.42770761e-04 3.28689625e+01
1716.lowfreq: -105.3761 -7.5845 -0.0007 -0.0005 -0.0004 12.1929 16.9702 73.3725 226.0382
frequency: -105.3598 73.3554 226.0379 231.9045 281.4804 352.7088 455.3017 468.7631 545.3490 668.1793 708.1370 799.1929 823.8037 951.9815 1023.2240 1104.3100 1142.3234 1174.3121 1284.0435 1303.2743 1342.1890 1403.4680 1460.8677 1472.5418 1488.5112 1535.8184 1600.8693 1659.1980 2947.7143 2985.3882 2997.1074 3098.9176 3132.5416 3531.3119 3543.0205 3700.5534
redmass: 2.1243 2.2528 1.2593 4.2208 1.1618 3.4489 1.1239 3.1041 1.1466 3.6731 9.7456 1.1131 3.9277 1.9698 1.9250 2.2065 1.5032 3.0516 1.0977 1.9391 1.5243 1.2070 1.0407 1.0509 1.1918 1.6616 1.2391 4.1870 1.0574 1.1052 1.0416 1.0938 1.1011 1.0681 1.0531 1.1036
irintensity: 1.4121 15.0226 14.4908 10.5928 2.7268 0.9140 376.5731 8.5226 76.3233 2.9806 22.8576 2.0181 1.8956 0.7275 19.5149 1.5593 6.9205 2.7673 0.1508 160.2242 186.2489 30.2766 9.8314 28.7650 30.1191 188.0794 89.8349 303.0810 76.6580 47.4381 42.3048 30.7446 26.3495 16.6593 14.7034 32.9997
temp: 298.150 k
press: 1.00000 atm
elementType: 8 7 7 6 6 6 1 1 1 1 1 1 1 1
symmnumber: 1
zpe: 308144.3 jmol-1
zpe.correction: 0.117366 hartree
zpe.thermalcorrener: 0.124116 hartree
zpe.thermalcorrenthalpy: 0.125060 hartree
zpe.thermalcorrgfe: 0.086952 hartree
zpe.sumelectzpe: -303.363984 hartree
zpe.sumelectthermal: -303.357234 hartree
zpe.sumelectthermalent: -303.356290 hartree
zpe.sumelectthermalfe: -303.394398 hartree
dipole: -0.7738 -4.4010 0.0025
dipole: 4.4685
quadrupole: -27.6716 -36.8504 -38.6561
quadrupole: 2.7864 -0.0083 -0.0010
quadrupole: 6.7211 -2.4577 -4.2634 2.7864 -0.0083 -0.0010
hfenergy: -303.4813499 hartree
pointgroup: C01 [X(C3H8N2O1)]
dipole: 0.2129955 -1.745097 -0.0009953 debye
dipolederiv: -0.7306864 0.066379 0.0002118 0.0336846 -1.1378418 -0.000693 0.000115 0.0009531 -0.3792261 -1.063596 -0.3440582 0.0003281 -0.4975804 -0.6007544 0.0002534 -0.000094 -0.0001108 -0.5292477 -1.2748983 0.2266194 -0.0004239 0.2919234 -0.3323156 -0.0000361 0.0003258 -0.000217 -0.8069645 0.7640854 0.0907033 0.0000778 -0.0410963 0.1352669 -0.0000573 -0.0001054 -0.0001503 0.3853512 0.0371631 0.0605838 0.0000051 0.0653002 -0.0618469 0.0000706 0.0000128 0.0001 0.0421417 2.0477137 -0.0009897 -0.0007783 0.1817503 1.6274399 0.0006864 -0.0012293 -0.0001141 0.3165955 -0.0935425 -0.0505772 -0.0494711 -0.044558 -0.019841 -0.1123149 -0.1087588 -0.1407324 -0.0970862 -0.0936904 -0.0507027 0.0495904 -0.0447526 -0.0199384 0.1122945 0.1088809 0.1407277 -0.096927 0.0482362 0.0567186 -0.0001539 0.0462955 0.0567133 -0.0000469 -0.0002042 -0.0001158 0.3505919 0.1169909 -0.0451784 -0.0608337 0.0017665 0.0236791 -0.0760135 -0.0543455 -0.077083 -0.0525068 0.116977 -0.0452864 0.0609512 0.0016704 0.0236805 0.0760131 0.0544929 0.0769923 -0.0522852 -0.2351737 0.017971 -0.0001686 -0.0350753 0.0802088 -0.0000326 -0.000163 -0.0000167 0.1077073 0.1601551 0.011867 0.0003723 0.0331076 0.0635772 -0.0000904 0.0005671 -0.0001899 0.4078519 0.2002658 0.0059504 0.0002929 0.007564 0.1619725 -0.0000333 0.0005055 -0.0000431 0.4040042 unknown
polarizability: 62.7221051|-0.8557398|54.0747942|-0.0057434|-0.0001411|32.8689625 unknown
InChI: InChI=1S/C3H8N2O/c1-2-5-3(4)6/h5H,2,4H2,1H3
charge 0 multiplicity 1
14 atoms
O  0.727336 1.341469 0.000097
N  -0.04176 -0.903021 0.000777
N  2.249948 -0.413289 -0.000326
C  -1.516883 -0.747382 -0.000001
C  -2.054345 0.696395 -0.000137
C  0.938053 0.091433 0.00142
H  -1.916849 -1.274416 -0.891519
H  -1.917741 -1.274597 0.891009
H  0.279597 -1.872742 0.000682
H  -1.720325 1.257502 0.885569
H  -1.719337 1.25769 -0.885359
H  -3.160338 0.646006 -0.000772
H  2.491343 -1.401855 -0.000977
H  2.995201 0.277807 -0.001463
