program: Gaussian 09
title: 000093478
version: EM64L-G09RevD.01
frameworkgroup: C1[X(C12H3Cl7O)]
method: RPBEPBE
basis: SDD
operation: Freq
keyword: #p
keyword: freq=noraman
keyword: PBEPBE/SDD
title: #p freq=noraman PBEPBE/SDD
converged: YES YES NO NO
title: Mulliken charges:
elementType: Cl Cl Cl Cl Cl Cl Cl O C C C C C C C C C C C C H H H
charge: 0.070500 0.070499 0.069562 0.069565 0.075347 -0.004320 -0.001393 -0.276725 0.628056 -0.308804 -0.308812 0.413549 -0.085902 -0.085888 -0.128191 -0.283111 -0.381733 -0.057296 -0.160468 -0.132940 0.283119 0.270826 0.264562
chargesum: 0.00000
title: Mulliken charges with hydrogens summed into heavy atoms:
elementType: Cl Cl Cl Cl Cl Cl Cl O C C C C C C C C C C C C
charge: 0.070500 0.070499 0.069562 0.069565 0.075347 -0.004320 -0.001393 -0.276725 0.628056 -0.308804 -0.308812 0.413549 -0.085902 -0.085888 -0.128191 0.000007 -0.110907 -0.057296 0.104093 -0.132940
polarizability: 2.75104787e+02 -1.39774202e-03 1.85757573e+02 2.76432586e+01 -1.37870381e-03 1.55589153e+02
1716.lowfreq: -1.1359 -0.0037 -0.0030 -0.0020 1.8250 5.2049 11.0747 19.4964 27.9023
frequency: 11.0096 19.4824 27.8954 66.5085 68.2918 88.5613 90.8249 165.0043 168.3453 171.1254 185.6762 199.8290 200.9043 213.6726 222.4248 266.9349 305.8408 310.7885 316.0093 328.4498 334.8505 352.4060 365.3420 413.7648 433.1205 438.1027 521.3355 557.6194 592.3891 593.1854 612.3544 659.1317 659.4444 665.0909 680.9856 729.4118 776.8122 813.4145 824.5985 841.1186 854.7498 938.7039 948.1519 999.2480 1071.8408 1109.1713 1130.7870 1182.9285 1235.0183 1250.7979 1321.5590 1335.3735 1348.4280 1371.9432 1389.8686 1449.9183 1526.2466 1538.0692 1580.6751 1598.4857 3168.7306 3171.5462 3188.4748
redmass: 26.8682 11.5381 24.8766 34.0102 26.2512 29.6338 9.3607 13.7423 5.8580 17.1228 26.3451 33.2296 30.2701 34.7064 20.2433 10.5629 19.4048 13.7971 12.6725 23.7881 11.5016 17.3895 12.8041 10.3041 11.8198 3.0731 8.9310 4.8455 9.9777 12.0817 13.0931 13.2314 8.0259 10.2282 3.7072 12.3063 11.6903 1.3518 12.1836 9.3770 1.5241 10.5410 1.3369 5.1913 11.1808 1.9713 1.2837 5.5210 4.1660 1.7514 12.0336 12.0199 10.0914 6.0975 4.7315 2.6627 12.0005 11.8323 7.9499 7.7149 1.0892 1.0924 1.0976
irintensity: 0.0065 0.2270 0.0371 0.0006 0.0119 0.0062 0.5950 0.3560 0.2405 0.3896 0.0134 0.0027 0.0589 0.0001 0.3741 0.0192 0.3115 0.0048 0.1204 0.0626 1.9545 1.7110 1.4733 2.2849 9.6503 6.7079 2.8404 2.7474 8.6473 0.0416 8.0465 67.1241 23.8718 0.5096 3.2191 66.1577 3.6468 31.6670 0.8954 29.9196 26.1802 46.4349 0.0641 62.6012 12.9379 98.3410 3.4923 141.2475 6.4379 47.3980 99.5967 61.5377 299.0062 153.0231 1.2489 246.0250 1.2712 5.6626 44.3939 47.9402 1.5369 0.5266 0.4669
temp: 298.150 k
press: 1.00000 atm
elementType: 17 17 17 17 17 17 17 8 6 6 6 6 6 6 6 6 6 6 6 6 1 1 1
symmnumber: 1
zpe: 299083.0 jmol-1
zpe.correction: 0.113915 hartree
zpe.thermalcorrener: 0.133326 hartree
zpe.thermalcorrenthalpy: 0.134270 hartree
zpe.thermalcorrgfe: 0.061578 hartree
zpe.sumelectzpe: -3753.271138 hartree
zpe.sumelectthermal: -3753.251727 hartree
zpe.sumelectthermalent: -3753.250783 hartree
zpe.sumelectthermalfe: -3753.323475 hartree
dipole: 0.6710 -0.0001 -1.5808
dipole: 1.7173
quadrupole: -166.8454 -163.7934 -159.6618
quadrupole: -0.0002 9.8834 -0.0002
quadrupole: -3.4119 -0.3599 3.7717 -0.0002 9.8834 -0.0002
hfenergy: -3753.3850528 hartree
pointgroup: C01 [X(C12H3Cl7O1)]
dipole: 0.2310908 0.0019946 0.6348832 debye
dipolederiv: -0.1594247 0.2558626 0.0845184 0.2532164 -0.4597215 -0.1276062 0.0798669 -0.1251906 -0.0207187 -0.1596854 -0.2554862 0.0861937 -0.2528663 -0.457847 0.1303105 0.0815258 0.1279047 -0.0223251 -0.1700206 0.25332 0.0478235 0.3127256 -0.4929116 -0.0926602 0.0857968 -0.1181997 -0.000497 -0.1702924 -0.2531578 0.0494822 -0.3123322 -0.4912661 0.0957655 0.0878629 0.1212991 -0.0018649 -0.5981407 0.0008651 0.2258613 0.0010557 0.0024367 -0.0003229 0.2889877 -0.0003388 -0.082513 -0.0867752 0.0000164 0.0002341 -0.0004457 -0.0256352 -0.0020295 -0.1470166 -0.0019995 -0.6810131 -0.7197126 -0.000473 -0.2028948 -0.0006623 -0.0247551 -0.0003089 -0.2624503 -0.0002928 -0.1368909 -2.319731 0.0000758 -0.1655189 0.0007179 -0.2429345 -0.0003376 0.0045538 -0.0004074 -0.3691687 1.2830826 -0.0004495 -0.0253737 -0.0024553 -0.0842132 0.0006008 -0.6554313 0.0007889 0.1035508 0.0342321 -0.4265581 -0.1436146 -0.509357 0.5553977 0.2568816 -0.0500519 0.193858 0.0104773 0.0347071 0.4259374 -0.1464302 0.5093297 0.5520487 -0.2601879 -0.0533843 -0.1972239 0.0133395 1.8399128 0.000455 0.309018 0.001635 0.1125411 0.0005322 0.7280825 0.0004321 0.317885 0.0300789 -0.4592857 0.0078072 -0.5620146 0.650675 0.2051376 -0.0205737 0.2145691 -0.0176065 0.030567 0.4595894 0.0047788 0.562162 0.6474589 -0.2094159 -0.0242763 -0.2188378 -0.0149027 0.816107 -0.0013578 -0.348328 -0.0015193 -0.2755319 0.0013823 -0.3970364 0.0013873 0.1291679 -0.3726745 -0.0000849 -0.057302 -0.0009289 -0.0940168 -0.0008109 -0.3374499 -0.0007266 -0.3591653 -0.4048661 -0.0002761 -0.1115151 0.0000901 -0.1574689 0.0005933 0.0012388 0.0005642 0.0222252 0.0895179 -0.0001437 -0.0315803 0.0002713 -0.0225699 0.0033274 0.1024581 0.0033022 1.0524669 -0.0687195 0.0000767 0.0293724 -0.0002369 -0.0703301 0.0004596 -0.0684183 0.0004807 0.0775682 0.9246301 0.0007815 0.3185037 0.0011753 -0.0775069 -0.0002491 0.4419686 -0.0002834 -0.1411859 0.0392962 0.000162 0.0459931 0.0003418 0.1347563 -0.0001857 0.1021017 -0.0002124 0.0758307 0.1121542 -0.0000896 -0.0330142 -0.0000713 0.1638394 -0.0005279 -0.0308176 -0.0005364 -0.0093164 -0.0042432 0.0002203 0.0559854 0.0001691 0.1575547 -0.0003483 0.0424632 -0.0003371 0.0546568 unknown
polarizability: 277.6651645|-0.0924543|185.7572751|-21.2504196|-0.0999793|153.0290738 unknown
InChI: InChI=1S/C12H3Cl7O/c13-5-2-1-4(3-6(5)14)20-12-10(18)8(16)7(15)9(17)11(12)19/h1-3H
charge 0 multiplicity 1
23 atoms
Cl 0.660495 2.758349 0.920479
Cl 0.659045 -2.752861 0.937798
Cl 3.588561 -2.787331 -0.44797
Cl 3.589925 2.782536 -0.465695
Cl 5.046421 -0.004893 -1.140474
Cl -3.051745 -0.008363 -2.965777
Cl -5.77121 -0.001952 -1.102791
O  -0.34747 0.0049 1.538701
C  0.85773 0.002357 0.825033
C  1.502262 1.224738 0.519059
C  1.501629 -1.222256 0.526746
C  -1.586744 0.003139 0.840784
C  2.780185 -1.22838 -0.074388
C  2.780799 1.226404 -0.082149
C  3.42036 -0.0021 -0.379087
C  -1.676909 -0.001243 -0.565416
C  -2.737561 0.006037 1.655853
C  -2.956223 -0.002782 -1.158857
C  -4.005203 0.004449 1.044448
C  -4.120345 0.000006 -0.363395
H  -0.78622 -0.003413 -1.199131
H  -2.630287 0.009426 2.743168
H  -4.912294 0.006633 1.654962
