program: Gaussian 09
title: 000093448
version: EM64L-G09RevD.01
frameworkgroup: C1[X(C6H12N2O3S)]
method: RPBEPBE
basis: SDD
operation: Freq
keyword: #p
keyword: freq=noraman
keyword: PBEPBE/SDD
title: #p freq=noraman PBEPBE/SDD
converged: YES YES NO NO
title: Mulliken charges:
elementType: S O O O N N C C C C C C H H H H H H H H H H H H
charge: 0.213273 -0.353410 -0.436739 -0.239505 -0.147149 0.088974 -0.314239 -0.620994 0.320696 -0.148922 -0.674754 -0.821570 0.229606 0.226066 0.271767 0.232126 0.246527 0.252240 0.247424 0.244639 0.359981 0.286243 0.293995 0.243724
chargesum: 0.00000
title: Mulliken charges with hydrogens summed into heavy atoms:
elementType: S O O O N N C C C C C C
charge: 0.213273 -0.353410 -0.076759 -0.239505 -0.147149 0.088974 0.141433 0.129427 0.320696 -0.148922 0.069549 0.002392
polarizability: 1.64625526e+02 1.34139628e+00 1.13910678e+02 2.85063034e+00 -1.91977572e-02 6.57162734e+01
1716.lowfreq: -10.5611 -5.9058 0.0020 0.0020 0.0021 5.7353 13.7371 48.3204 56.2294
frequency: 11.5675 48.2865 56.2249 81.3372 93.8532 105.6676 114.1685 118.3073 140.4649 153.3148 182.7589 244.2319 259.7572 290.3543 334.3004 366.2182 388.6498 451.7078 474.0762 476.2294 543.4891 611.3078 651.9857 683.5096 706.4864 815.7154 841.8195 927.0388 957.1283 977.0212 980.8275 999.2715 1007.4259 1025.1493 1074.9120 1124.5098 1146.9982 1170.1939 1235.2567 1333.8206 1349.0404 1361.5583 1387.2708 1402.1549 1429.7723 1435.6021 1450.6208 1455.5153 1458.3478 1460.8726 1482.1295 1486.3873 1547.2518 1702.8494 2984.8819 2992.1102 3021.6915 3026.4100 3067.9561 3079.0652 3110.4668 3112.7563 3124.0132 3154.5026 3155.8026 3540.1495
redmass: 3.6301 5.1675 4.9578 3.7650 2.6715 3.2905 1.1548 1.3709 1.1113 2.8938 3.6285 3.9161 6.7288 5.3557 3.6834 4.6725 2.1216 2.7374 1.9205 3.8066 6.0938 5.6224 7.1825 11.0091 4.7776 5.9092 10.2434 4.8616 3.0568 1.8258 1.1902 1.7653 1.4573 1.4712 2.3898 1.3001 3.0578 1.5230 3.2334 1.1997 1.1306 2.4061 1.2052 1.1780 1.1791 1.0506 1.0576 1.0568 1.0927 1.0846 1.0759 1.0453 7.6168 10.6770 1.0350 1.0364 1.0630 1.0279 1.1029 1.0974 1.1004 1.1034 1.0989 1.1051 1.1055 1.0654
irintensity: 0.2008 0.9746 2.9508 5.2752 11.0669 0.6882 0.2845 0.1088 0.0346 3.7012 0.9995 1.2027 1.5041 1.4498 17.5763 1.5186 33.8746 12.2881 81.9401 0.2316 3.3142 32.1610 7.1223 22.2402 11.7754 224.2912 46.0909 157.9437 121.7977 12.6921 5.5985 71.0545 1.5820 3.9179 311.2801 1.3624 86.1338 166.6621 18.4823 13.9562 1.5202 192.1767 31.8990 23.2643 63.1545 16.1518 17.4730 11.2494 37.5306 14.3734 16.8300 18.7372 32.3674 311.2259 60.2557 6.2827 47.6694 14.0622 28.6203 10.7782 13.6084 24.5665 3.5048 8.3384 7.2969 6.9157
temp: 298.150 k
press: 1.00000 atm
elementType: 16 8 8 8 7 7 6 6 6 6 6 6 1 1 1 1 1 1 1 1 1 1 1 1
symmnumber: 1
zpe: 484395.0 jmol-1
zpe.correction: 0.184496 hartree
zpe.thermalcorrener: 0.199965 hartree
zpe.thermalcorrenthalpy: 0.200909 hartree
zpe.thermalcorrgfe: 0.139348 hartree
zpe.sumelectzpe: -968.056953 hartree
zpe.sumelectthermal: -968.041485 hartree
zpe.sumelectthermalent: -968.040541 hartree
zpe.sumelectthermalfe: -968.102102 hartree
dipole: -0.2806 1.3072 1.2334
dipole: 1.8190
quadrupole: -68.8227 -83.4646 -78.7322
quadrupole: -2.2977 4.0199 -0.3001
quadrupole: 8.1838 -6.4581 -1.7257 -2.2977 4.0199 -0.3001
hfenergy: -968.2414498 hartree
pointgroup: C01 [X(C6H12N2O3S1)]
dipole: 0.1265185 -0.4797338 0.5157544 debye
dipolederiv: -0.5678517 -0.1014885 0.0272729 -0.157134 -0.1134304 0.0062284 0.0298505 0.0059001 -0.0816239 -2.0424287 0.487897 0.0790449 0.4295508 -0.5957622 0.0591282 0.0687132 0.0221239 -0.1809212 -0.2441088 0.0764269 -0.0069266 -0.086679 -0.8676297 0.0131742 -0.0837954 -0.2160055 -0.6218313 -0.676824 -0.0952115 0.0842503 0.0646701 -1.0614274 0.2188606 0.0902567 0.2734735 -0.4219038 -1.3514747 -0.1658869 0.182658 -0.1205524 -0.8614156 0.0562014 0.3309855 0.2228756 -0.4951834 0.4797529 -0.220766 -0.0200315 0.7147171 -0.3202178 -0.0357626 -0.0677945 0.0091081 -0.1144463 0.370166 0.0411709 -0.0444292 0.33102 1.1260921 0.0269271 -0.1046641 0.1246538 0.6596034 0.4408295 -0.1834395 0.0425055 -0.3464223 0.1337695 0.0953276 0.0933335 0.0375513 0.2065353 2.4143075 -0.0174962 -0.3514028 -0.7420165 1.5590929 -0.3110129 -0.3281679 -0.3642882 0.4525087 1.0442032 0.2278842 -0.0617047 -0.1224361 0.3132725 0.0199772 -0.0808095 0.011527 -0.0336347 -0.0775282 -0.1754015 0.0118749 -0.0610906 -0.1933187 -0.0055857 0.0214963 -0.0058756 0.0904699 0.0320189 0.0596791 -0.004736 0.0806661 0.150682 0.0003712 -0.0012712 0.0005803 0.0443919 0.0179577 0.0357749 -0.163786 -0.0026417 -0.0440893 -0.0088069 -0.1091707 -0.0153095 -0.0734796 -0.110392 -0.0123514 0.1182345 -0.0118818 0.0459821 -0.0258998 0.0488671 -0.0215331 0.0505455 0.1505317 -0.0787131 0.0347947 0.0179066 -0.0021573 0.0598947 -0.0076285 0.0690418 0.1000878 -0.0659527 0.073807 0.0686997 0.0694827 0.0921172 -0.0207095 0.1238996 -0.0614205 -0.0869038 -0.0895894 0.0017106 -0.0719859 -0.0460637 0.0519937 -0.1053278 -0.1253947 -0.0618345 0.0186488 0.053849 -0.0608756 0.1042421 -0.0286907 0.06459 -0.0074263 0.0863892 0.0341823 -0.0086117 0.0603939 -0.0617739 -0.1039575 -0.0206393 0.0584787 0.0015539 -0.0883085 -0.0346697 -0.0193551 -0.0491792 0.1334982 -0.0074228 0.081498 0.07079 0.0009374 -0.0056373 0.0041348 0.1287028 0.11349 0.0024373 0.0784524 0.0416447 0.3597217 -0.0374789 0.1062645 -0.02351 0.2746595 0.1064469 0.0503051 0.0707206 -0.0163955 -0.0130528 -0.0451843 0.0531463 -0.038972 -0.025289 0.0870697 0.0544501 -0.0868221 -0.0084872 -0.0032386 0.0408071 -0.0697003 0.0236308 0.0064801 -0.0956875 -0.071637 0.0204547 -0.0600255 0.0491573 0.0038058 0.0191402 0.0046356 0.1305504 unknown
polarizability: 163.9294538|-0.6765155|113.6229628|-8.9165609|-3.4510442|66.7000601 unknown
InChI: InChI=1S/C6H12N2O3S/c1-5(12-3)7-11-6(10)8(2)4-9/h9H,4H2,1-3H3
charge 0 multiplicity 1
24 atoms
S  3.859644 -0.423872 -0.318354
O  -0.136504 -0.218827 -0.069027
O  -2.47954 -1.980326 -0.27566
O  -0.787107 2.016882 -0.612505
N  -2.313981 0.422382 0.221981
N  1.273196 0.266205 -0.163185
C  -2.499031 -0.937042 0.749076
C  -3.505551 1.234841 -0.093429
C  -1.068708 0.883683 -0.182117
C  2.075975 -0.773665 -0.217076
C  1.711039 -2.238721 -0.218459
C  3.868506 1.46032 -0.3437
H  -1.729538 -1.12737 1.518944
H  -3.504811 -0.998113 1.190969
H  -3.177644 2.175684 -0.560425
H  -4.067171 1.472009 0.828205
H  -4.166966 0.690983 -0.792308
H  1.068078 -2.474656 0.647993
H  1.143955 -2.486591 -1.134818
H  2.608606 -2.876375 -0.181464
H  -1.558353 -2.015031 -0.644276
H  3.436299 1.84379 0.590994
H  3.27796 1.818851 -1.198251
H  4.926549 1.74736 -0.440508
