program: Gaussian 09
title: 000093444
version: EM64L-G09RevD.01
frameworkgroup: C1[X(C12H3Cl7)]
method: RPBEPBE
basis: SDD
operation: Freq
keyword: #pfreq=noraman
keyword: PBEPBE/SDD
title: #p freq=noraman PBEPBE/SDD
converged: NO NO NO YES
title: Mulliken charges:
elementType: Cl Cl Cl Cl Cl Cl Cl C C C C C C C C C C C C H H H
charge: 0.045321 0.045322 -0.019746 -0.019747 0.058538 0.058539 0.067209 0.593907 0.473518 -0.306051 -0.306059 -0.257654 -0.257653 -0.082121 -0.082138 -0.111355 -0.232488 -0.232489 -0.207750 0.264415 0.264415 0.244066
chargesum: 0.00000
title: Mulliken charges with hydrogens summed into heavy atoms:
elementType: Cl Cl Cl Cl Cl Cl Cl C C C C C C C C C C C C
charge: 0.045321 0.045322 -0.019746 -0.019747 0.058538 0.058539 0.067209 0.593907 0.473518 -0.306051 -0.306059 -0.257654 -0.257653 -0.082121 -0.082138 -0.111355 0.031927 0.031926 0.036316
polarizability: 2.56557034e+02 -1.76985613e-03 1.83790067e+02 7.91888653e-04 -1.92999128e-03 1.46925142e+02
1716.lowfreq: -0.0021 -0.0004 0.0008 6.2439 8.1127 8.8155 22.6723 35.4950 53.4378
frequency: 22.6710 35.4942 53.4311 66.6954 74.7689 86.5285 94.5702 132.0632 189.4404 194.6588 203.5135 204.4892 206.2172 216.3908 255.5028 297.3874 310.4197 328.1159 328.9658 329.3636 355.3393 387.0325 400.1078 470.5680 496.3546 525.6746 587.5814 601.6034 608.6856 637.7402 641.2133 705.5540 740.8695 749.8451 781.7077 785.5297 818.4925 837.0320 896.9364 975.6396 1003.0909 1064.9417 1069.8042 1143.5970 1155.9486 1194.0275 1244.4571 1313.1548 1330.7642 1354.2442 1356.2002 1415.2214 1451.0895 1518.2677 1554.4171 1560.5583 1596.2630 3152.2426 3173.4980 3184.0045
redmass: 22.9973 19.0717 6.8904 34.1373 30.9434 28.1542 30.5904 28.0555 14.0781 4.5865 32.6653 31.1357 25.0278 34.4643 18.8107 8.4088 16.6367 30.3903 12.4850 8.9156 31.9160 8.7943 13.9071 9.2166 4.8146 5.3167 12.0927 12.0842 7.8826 10.3569 7.8501 8.6743 9.2333 2.9414 11.6492 1.7574 12.8907 9.3006 1.3672 1.3353 9.4570 2.7455 6.1655 4.0173 1.4485 1.4044 5.6423 12.0474 12.0033 10.2750 5.1002 2.2234 4.2804 12.0008 11.2333 6.9242 8.7822 1.0877 1.0931 1.0996
irintensity: 0.0000 0.2189 1.5337 0.0000 0.0531 0.0155 0.0621 0.1133 0.0600 0.0000 0.2929 0.0543 0.3974 0.0001 0.3144 1.2007 0.7338 0.0353 0.0000 0.0041 0.3170 4.7057 12.6332 2.1760 1.3064 0.0000 25.5002 0.0000 2.8748 0.1341 77.4496 18.8668 71.3427 4.5606 5.3339 57.5792 0.5386 6.9401 0.0000 0.3366 6.2151 7.8373 6.9566 1.6574 7.7285 13.4835 59.7884 170.2398 11.2772 3.6494 88.0285 69.1482 0.0006 0.1101 14.8487 47.6999 14.2464 5.0544 0.4161 5.1723
temp: 298.150 k
press: 1.00000 atm
elementType: 17 17 17 17 17 17 17 6 6 6 6 6 6 6 6 6 6 6 6 1 1 1
symmnumber: 1
zpe: 289914.9 jmol-1
zpe.correction: 0.110423 hartree
zpe.thermalcorrener: 0.128779 hartree
zpe.thermalcorrenthalpy: 0.129723 hartree
zpe.thermalcorrgfe: 0.060998 hartree
zpe.sumelectzpe: -3678.151570 hartree
zpe.sumelectthermal: -3678.133214 hartree
zpe.sumelectthermalent: -3678.132270 hartree
zpe.sumelectthermalfe: -3678.200995 hartree
dipole: -3.4602 0.0001 0.0002
dipole: 3.4602
quadrupole: -135.8191 -160.0722 -157.0027
quadrupole: -0.0003 -0.0007 -0.0007
quadrupole: 15.1456 -9.1076 -6.0380 -0.0003 -0.0007 -0.0007
hfenergy: -3678.2619927 hartree
pointgroup: C01 [X(C12H3Cl7)]
dipole: -1.3613291 -0.0000407 -0.0000858 debye
dipolederiv: -0.2425238 -0.2694788 -0.0003971 -0.2730747 -0.5050883 -0.0007475 -0.0004067 -0.0007546 0.0058211 -0.2425061 0.2694652 0.0003684 0.2730652 -0.5051129 -0.0007082 0.0003431 -0.0006607 0.0058227 -0.2586784 0.0003612 -0.2480278 0.0003053 -0.0357218 0.0008677 -0.2008152 0.0008481 -0.6145569 -0.258733 -0.0003726 0.2480747 -0.0003173 -0.035721 0.00089 0.2008599 0.0008657 -0.6144977 -0.2072469 -0.2876539 -0.0004102 -0.321543 -0.4977899 -0.0007305 -0.0004381 -0.0007087 0.0147643 -0.2072202 0.2876372 0.0004043 0.3215367 -0.4978164 -0.0007232 0.0004648 -0.0007423 0.0147658 -0.7171988 0.0000055 0.0000183 0.0000025 -0.0039997 -0.0000294 0.0000496 -0.0000331 0.0166781 0.2056351 -0.0000008 0.0000044 0.0000102 -0.2884427 -0.000502 -0.0000037 -0.000484 0.0641532 0.1689935 -0.0000112 0.000019 -0.0000334 0.0176851 0.0006784 0.0000297 0.0006649 -0.4292794 0.2347684 0.4581329 0.0006727 0.4752418 0.6304259 0.0009777 0.0006953 0.0009624 -0.0248099 0.2347504 -0.4581212 -0.0006259 -0.4752393 0.6304646 0.0008912 -0.0006093 0.0008288 -0.0248102 0.3086506 -0.0005757 0.3992136 -0.0003003 -0.0321443 -0.0014156 0.2033289 -0.0013916 0.9155413 0.3087177 0.0006042 -0.3992746 0.0003481 -0.032144 -0.0014569 -0.2034022 -0.0014207 0.9154543 -0.0190409 0.5494489 0.0007823 0.5818344 0.6012228 0.0008904 0.0008078 0.0008925 -0.0242502 -0.0190747 -0.549428 -0.0007677 -0.581811 0.6012678 0.0008691 -0.000826 0.0008996 -0.0242502 0.9914858 -0.0000077 -0.0000524 -0.0000129 -0.1921396 -0.0002293 -0.0000702 -0.0002335 -0.0254781 -0.2129309 0.0003038 -0.2048829 0.0001497 -0.1038247 0.0001532 -0.0991931 0.0001436 -0.2093273 -0.2129604 -0.0003055 0.2048844 -0.0001517 -0.1038248 0.0001623 0.099189 0.0001567 -0.2092883 0.1250106 0.0000086 -0.0000036 0.0000122 -0.1254296 -0.0004498 -0.0000021 -0.0004433 0.1782595 0.0558542 -0.0000641 0.0406718 -0.0000957 0.1608808 0.0002413 0.0574057 0.0002405 0.000477 0.055866 0.00006 -0.0406636 0.0000823 0.1608811 0.0002439 -0.0573984 0.0002372 0.0004675 -0.091618 -0.0000082 -0.0000084 -0.000009 0.1563717 0.0001271 -0.000009 0.0001324 0.0683435 unknown
polarizability: 256.5570339|0.0022985|183.7900054|0.0001276|0.0476047|146.9252031 unknown
InChI: InChI=1S/C12H3Cl7/c13-4-2-1-3-5(14)6(4)7-8(15)10(17)12(19)11(18)9(7)16/h1-3H
charge 0 multiplicity 1
22 atoms
Cl -0.095276 -2.769214 -0.003966
Cl -0.095201 2.769332 0.003915
Cl -1.27236 -0.004059 2.790251
Cl -1.272037 0.00421 -2.790223
Cl 3.125498 2.783644 0.004019
Cl 3.125404 -2.783626 -0.003853
Cl 4.733359 0.000021 -0.000005
C  0.084553 0.000048 0.000089
C  -1.412818 0.00007 0.000004
C  0.814908 -1.212596 -0.001648
C  0.814927 1.212681 0.00186
C  -2.159697 -0.001706 1.204654
C  -2.159564 0.001795 -1.204732
C  2.227944 1.2254 0.001865
C  2.227922 -1.225345 -0.00162
C  2.935894 0.000025 0.000112
C  -3.566955 -0.001814 1.226234
C  -3.566821 0.001825 -1.226474
C  -4.266816 -0.000018 -0.000159
H  -4.099821 -0.003267 2.180786
H  -4.099577 0.003247 -2.181087
H  -5.361367 -0.000055 -0.000221
