program: Gaussian 09
title: 000093442
version: EM64L-G09RevD.01
frameworkgroup: C1[X(C12H4Cl6)]
method: RPBEPBE
basis: SDD
operation: Freq
keyword: #pfreq=noraman
keyword: PBEPBE/SDD
title: #p freq=noraman PBEPBE/SDD
converged: NO NO NO NO
title: Mulliken charges:
elementType: Cl Cl Cl Cl Cl Cl C C C C C C C C C C C C H H H H
charge: 0.033385 -0.003214 -0.022139 -0.022136 0.049619 0.019940 0.539383 0.483996 -0.231332 -0.291195 -0.259812 -0.259810 -0.084539 -0.235151 -0.102346 -0.232981 -0.232978 -0.208469 0.288896 0.263754 0.263753 0.243375
chargesum: 0.00000
title: Mulliken charges with hydrogens summed into heavy atoms:
elementType: Cl Cl Cl Cl Cl Cl C C C C C C C C C C C C
charge: 0.033385 -0.003214 -0.022139 -0.022136 0.049619 0.019940 0.539383 0.483996 -0.231332 -0.291195 -0.259812 -0.259810 -0.084539 0.053745 -0.102346 0.030772 0.030776 0.034907
polarizability: 2.47110228e+02 3.19609336e+00 1.60303701e+02 1.43321610e-03 -5.64963568e-04 1.44458382e+02
1716.lowfreq: -4.9927 -4.6096 0.0033 0.0038 0.0040 4.9229 20.8906 34.7992 54.6366
frequency: 20.8576 34.7848 54.6309 70.2955 86.4160 89.5578 131.9130 155.6838 184.3573 195.3961 199.4034 206.3950 254.9702 271.9556 293.3662 313.1736 330.9683 350.6261 386.7538 387.4067 471.2230 471.3416 513.7945 525.6810 532.9409 551.5716 613.5438 622.9422 700.1821 732.4905 743.1057 754.2661 768.9988 784.6266 826.2262 862.4830 898.6407 974.7163 991.4529 1063.6384 1069.2358 1122.4761 1155.6210 1160.7352 1194.0096 1249.2813 1319.9677 1340.0273 1353.2417 1394.3884 1414.8817 1458.8377 1534.6814 1560.0221 1571.5693 1596.8430 3152.0161 3173.5822 3184.0377 3186.1814
redmass: 21.3515 19.3737 7.0617 32.4108 26.8914 28.0918 28.0953 9.9440 28.2260 4.6272 25.0530 31.6031 18.7145 7.2798 7.3658 24.7406 9.1972 32.5443 8.7477 13.9845 9.2602 5.6330 9.4784 5.1984 4.6606 5.8264 6.3588 9.9637 8.1448 7.9891 3.1741 8.8632 8.5200 1.6920 9.3584 1.4177 1.3629 1.3342 8.7337 3.0150 5.2034 2.7154 1.4598 2.1926 1.3992 3.2461 6.4409 11.1950 10.2882 3.0655 2.2098 4.3369 10.3227 6.8951 9.4562 8.9153 1.0877 1.0931 1.0996 1.0935
irintensity: 0.0096 0.2497 1.5405 0.0030 0.0365 0.1396 0.0588 0.3032 0.3859 0.0002 0.6143 0.0210 0.4077 1.2365 1.6804 0.4780 0.0012 0.0794 4.1981 12.7314 1.8425 2.1974 8.7841 0.6666 4.9049 12.6427 37.2632 0.0521 15.7291 51.6587 18.0385 27.6481 34.3937 65.1489 10.9402 19.0783 0.0000 0.5467 12.2131 10.1075 12.3261 8.7531 8.0981 31.3025 13.4980 11.9164 89.3871 4.0038 3.9457 95.4552 68.9521 6.4215 31.1269 47.7667 60.1051 6.0522 5.1826 0.4988 5.4190 2.5741
temp: 298.150 k
press: 1.00000 atm
elementType: 17 17 17 17 17 17 6 6 6 6 6 6 6 6 6 6 6 6 1 1 1 1
symmnumber: 1
zpe: 314704.1 jmol-1
zpe.correction: 0.119864 hartree
zpe.thermalcorrener: 0.136983 hartree
zpe.thermalcorrenthalpy: 0.137927 hartree
zpe.thermalcorrgfe: 0.072058 hartree
zpe.sumelectzpe: -3218.773876 hartree
zpe.sumelectthermal: -3218.756758 hartree
zpe.sumelectthermalent: -3218.755813 hartree
zpe.sumelectthermalfe: -3218.821682 hartree
dipole: -2.9819 0.4657 0.0002
dipole: 3.0180
quadrupole: -127.3524 -144.4320 -145.6546
quadrupole: 6.5901 0.0000 -0.0001
quadrupole: 11.7939 -5.2856 -6.5083 6.5901 0.0000 -0.0001
hfenergy: -3218.8937402 hartree
pointgroup: C01 [X(C12H4Cl6)]
dipole: -1.1572309 0.2659065 -0.0002343 debye
dipolederiv: -0.1918458 -0.222859 0.0001011 -0.2290164 -0.5481755 0.0002752 0.0001068 0.0002863 -0.0011743 -0.3284404 0.2808801 -0.0001921 0.2937243 -0.5607258 0.0003263 -0.0001916 0.0003085 -0.024416 -0.2557201 -0.0216026 -0.2476077 -0.0229782 -0.0396383 -0.0264042 -0.2036639 -0.0251408 -0.6208583 -0.2558013 -0.0213504 0.2476822 -0.0227963 -0.0395875 0.025835 0.2037443 0.0245411 -0.620844 -0.2943961 0.3024478 -0.0002047 0.367426 -0.4079363 0.000276 -0.0002565 0.0002821 0.010472 -0.7824923 -0.1088714 -0.0000503 -0.1297503 -0.0824109 0.0000156 -0.0000438 0.0000164 -0.0156859 0.1719678 0.0774171 -0.0000367 0.0259825 -0.3839321 0.0002379 -0.0000265 0.0002346 0.0464917 0.1708703 0.0021782 0.0000616 0.0115999 0.0243046 -0.0002171 0.0000776 -0.0002207 -0.4299845 0.2027734 0.3624841 -0.0001768 0.3785882 0.730711 -0.0003686 -0.0001832 -0.0003737 -0.0021237 0.4516618 -0.4360707 0.0003036 -0.3309676 0.8729121 -0.0005363 0.0002498 -0.0005306 -0.0433502 0.3062712 0.0397314 0.3950413 0.0397658 -0.0267386 0.0392455 0.2138386 0.0327909 0.9225855 0.3063744 0.0393322 -0.3951885 0.0395965 -0.0268094 -0.0383176 -0.2140053 -0.0318148 0.9225606 0.0502068 -0.638562 0.0003624 -0.6697639 0.4038759 -0.0003318 0.000406 -0.000345 -0.0420042 -0.4640427 0.1044754 -0.0001076 0.0881407 -0.2346771 0.0001162 -0.0001022 0.0001023 -0.0527376 1.1259514 0.2893269 0.0000125 0.2229948 0.1353131 -0.0000566 0.0000374 -0.0000376 -0.0354806 -0.2125167 -0.0094715 -0.201764 -0.0122669 -0.1065907 -0.0204093 -0.0994757 -0.0126068 -0.2102096 -0.2125681 -0.0092659 0.2017738 -0.0121646 -0.1065551 0.0203128 0.0994937 0.0124968 -0.2101914 0.1207833 0.0277854 -0.000021 0.0268129 -0.1237279 0.0001577 -0.0000169 0.0001627 0.1769094 0.0679652 -0.0124346 -0.0000079 -0.0153838 0.0459353 0.0000597 -0.0000093 0.000064 0.1639139 0.0567989 -0.010017 0.0413249 -0.0115902 0.1602345 0.0043309 0.0582643 0.0058204 -0.0008586 0.0568173 -0.010056 -0.0413061 -0.011649 0.160224 -0.0044962 -0.0582431 -0.0059905 -0.0008667 -0.0906184 -0.0254975 -0.0000002 -0.0263044 0.1539946 -0.0000508 -0.0000006 -0.0000456 0.0678525 unknown
polarizability: 247.126159|-2.9717922|160.287759|0.0170386|-0.0112079|144.4583919 unknown
InChI: InChI=1S/C12H4Cl6/c13-5-2-1-3-6(14)9(5)10-7(15)4-8(16)11(17)12(10)18/h1-4H
charge 0 multiplicity 1
22 atoms
Cl 0.354945 -2.59665 0.001454
Cl -0.192655 2.93928 -0.001677
Cl -1.120344 0.030559 2.791031
Cl -1.119865 0.027669 -2.791448
Cl 3.567132 -2.266788 0.001654
Cl 4.850289 0.723482 0.000246
C  0.230593 0.176683 -0.000178
C  -1.25745 0.016529 -0.000213
C  1.093694 -0.948986 0.000587
C  0.84298 1.452833 -0.000769
C  -2.001757 -0.061761 1.203785
C  -2.001542 -0.063071 -1.204261
C  2.502829 -0.815626 0.000695
C  2.237647 1.624824 -0.00062
C  3.060616 0.483649 0.000102
C  -3.401189 -0.211497 1.225928
C  -3.400977 -0.212774 -1.226497
C  -4.097296 -0.286683 -0.000307
H  2.679332 2.623777 -0.001065
H  -3.930571 -0.268478 2.180731
H  -3.930192 -0.270729 -2.181337
H  -5.185621 -0.403741 -0.000341
