program: Gaussian 09
title: 000093440
version: EM64L-G09RevD.01
frameworkgroup: C1[X(C12H5Cl5)]
method: RPBEPBE
basis: SDD
operation: Freq
keyword: #pfreq=noraman
keyword: PBEPBE/SDD
title: #p freq=noraman PBEPBE/SDD
converged: NO NO NO NO
title: Mulliken charges:
elementType: Cl Cl Cl Cl Cl C C C C C C C C C C C C H H H H H
charge: 0.033135 -0.003534 0.050410 0.020070 -0.054730 0.514416 0.306621 -0.264317 -0.319396 -0.319862 -0.352669 -0.086275 -0.233263 -0.097600 -0.074412 -0.193412 -0.232618 0.270462 0.249112 0.290073 0.237281 0.260508
chargesum: 0.00000
title: Mulliken charges with hydrogens summed into heavy atoms:
elementType: Cl Cl Cl Cl Cl C C C C C C C C C C C C
charge: 0.033135 -0.003534 0.050410 0.020070 -0.054730 0.514416 0.306621 -0.264317 -0.319396 -0.049400 -0.103557 -0.086275 0.056810 -0.097600 -0.074412 0.043869 0.027890
polarizability: 2.50547866e+02 2.81028266e-01 1.58543639e+02 5.84530058e+00 -2.15670895e-01 1.21749968e+02
1716.lowfreq: -7.2125 -0.0006 0.0011 0.0018 1.7563 4.3082 9.2267 34.8141 54.6016
frequency: -6.2809 34.7989 54.5985 70.4536 102.7443 150.6360 171.4782 176.1419 186.7709 206.7533 233.7264 239.7952 267.2100 298.1503 313.0024 350.1955 383.6993 421.3089 429.1095 471.1656 508.0726 525.5997 550.6573 617.1258 624.0296 655.3612 699.9526 720.6977 747.7686 768.1459 791.8361 839.9736 860.3812 891.7453 910.0248 979.9460 983.2307 1014.1992 1074.1578 1089.0983 1112.1917 1159.9347 1178.9428 1248.9727 1284.2415 1318.0470 1336.6568 1365.5841 1398.2720 1415.5734 1469.5330 1530.3859 1568.0883 1571.3127 1605.6279 3141.5321 3159.8722 3165.9549 3176.3326 3184.9803
redmass: 10.0635 19.5839 7.4680 30.6247 16.3451 11.4447 12.2203 5.8126 21.9280 32.5812 9.3165 5.4838 8.0422 7.9911 26.3901 32.4585 11.1152 8.1213 3.3376 6.5004 8.5237 4.5757 7.9912 9.7497 6.4937 7.4797 2.2549 9.1073 8.5007 10.3544 1.4807 8.4999 1.4112 1.4532 1.3723 1.3447 6.3331 7.5560 2.2106 1.7154 2.9840 2.1392 1.0846 3.1745 1.3828 5.2768 11.4619 8.0768 2.9431 3.0500 2.9560 10.3642 9.5665 6.6064 6.8929 1.0871 1.0939 1.0933 1.0987 1.0934
irintensity: 0.3481 0.0749 0.4775 0.0256 0.1052 0.0362 0.6530 0.0153 0.0404 0.0016 0.1639 0.0351 2.4185 0.2691 0.0989 0.0239 5.7482 2.3755 1.9461 10.0302 4.9394 4.9904 35.0906 0.2321 11.4323 22.4006 44.0679 14.7802 1.9980 60.9721 29.2653 36.5590 19.5206 5.3660 1.1920 0.1186 4.2629 28.3301 21.8537 9.0006 6.6249 33.0331 0.1249 7.2121 5.8463 93.4338 5.3301 1.0209 70.8889 93.5152 5.2169 29.2216 24.9667 50.8640 30.7058 4.7089 6.6643 0.6414 7.1869 2.5153
temp: 298.150 k
press: 1.00000 atm
elementType: 17 17 17 17 17 6 6 6 6 6 6 6 6 6 6 6 6 1 1 1 1 1
symmnumber: 1
zpe: 339774.0 jmol-1
zpe.correction: 0.129413 hartree
zpe.thermalcorrener: 0.144325 hartree
zpe.thermalcorrenthalpy: 0.145270 hartree
zpe.thermalcorrgfe: 0.085487 hartree
zpe.sumelectzpe: -2759.387835 hartree
zpe.sumelectthermal: -2759.372922 hartree
zpe.sumelectthermalent: -2759.371978 hartree
zpe.sumelectthermalfe: -2759.431761 hartree
dipole: 0.2150 1.0364 1.7663
dipole: 2.0591
quadrupole: -134.3171 -133.9115 -126.7807
quadrupole: -3.7718 8.2360 -0.6634
quadrupole: -2.6473 -2.2417 4.8891 -3.7718 8.2360 -0.6634
hfenergy: -2759.5172477 hartree
pointgroup: C01 [X(C12H5Cl5)]
dipole: 0.1073512 -0.3985417 -0.6970926 debye
dipolederiv: -0.1938251 -0.2211298 0.0244343 -0.2275359 -0.5563918 0.0446036 0.0266588 0.0428935 -0.0114956 -0.3158391 0.2738669 0.0175453 0.2878794 -0.5877226 -0.0144811 0.0202105 -0.0111982 -0.0326246 -0.2980294 0.301676 0.0138762 0.3784236 -0.4203749 -0.0166099 0.0179211 -0.0152203 0.0098488 -0.7851298 -0.0976066 0.07258 -0.1181964 -0.0791732 0.0128788 0.0839744 0.0123719 -0.024145 -0.4525671 -0.037685 -0.3094963 -0.0481762 -0.0718842 -0.0428147 -0.4239286 -0.0458908 -0.5565174 0.2679469 0.083011 -0.014065 0.0230565 -0.4064299 0.010883 -0.0484599 0.0019863 -0.0389734 0.2804964 0.0121187 -0.0196395 0.0264424 -0.0177023 0.0027031 0.0341053 0.0075701 0.1313471 0.1860526 0.3441634 -0.0361276 0.3980104 0.7374808 -0.0750505 -0.0330109 -0.0591201 -0.010726 0.4116236 -0.414099 -0.0392009 -0.3446634 0.9082926 0.0143627 -0.0363312 0.0103494 -0.0555654 -0.3509583 -0.0223641 -0.173554 -0.0241075 -0.0594486 -0.0161194 -0.0618407 -0.010939 -0.1483284 -0.2259295 0.0005059 0.0983287 -0.0089027 -0.0981896 0.0088089 -0.0227367 0.0040508 -0.004924 0.0394245 -0.6073591 0.0164389 -0.6680884 0.4353346 0.0422145 0.0158507 0.0442434 -0.0468999 -0.4581999 0.0811293 0.034879 0.0812438 -0.2362097 -0.006059 0.0383518 -0.0030696 -0.058714 1.1164762 0.2730721 -0.1185963 0.2098647 0.1029242 -0.022307 -0.1277869 -0.0327995 -0.0214286 0.5975613 0.0662804 0.5270366 0.0753701 -0.0375661 0.0733671 0.6348648 0.0736335 0.8130849 0.0786241 0.0165916 -0.0282812 0.0158987 -0.1232431 0.0054853 -0.0290985 0.0035279 0.1084772 -0.0815189 0.0045912 -0.106891 -0.001192 -0.1158684 -0.014231 -0.144009 -0.0154712 -0.2626331 0.1009386 -0.0041721 0.0509398 0.0000262 0.1355229 -0.0000721 0.0696779 0.0005614 0.0103495 0.0438082 -0.0127756 -0.0933074 -0.0094223 0.131642 -0.0117144 -0.0975731 -0.0102603 0.0027252 0.0666758 -0.013364 0.0096515 -0.0173507 0.0462629 0.0062446 0.011448 0.0056766 0.1666236 0.0205205 -0.0082597 0.0591635 -0.0098209 0.1501415 -0.0015269 0.07061 -0.0012013 -0.0725107 -0.0481515 -0.0181915 0.0142851 -0.0187594 0.162603 -0.0005655 0.0011021 -0.0016944 0.1030299 unknown
polarizability: 250.6396821|-3.8566913|158.6989181|1.2769926|0.44989|121.5028725 unknown
InChI: InChI=1S/C12H5Cl5/c13-7-3-1-2-6(4-7)10-8(14)5-9(15)11(16)12(10)17/h1-5H
charge 0 multiplicity 1
22 atoms
Cl -0.457027 2.58439 -0.204427
Cl 0.01533 -2.968854 -0.064506
Cl -3.651438 2.301426 0.132235
Cl -4.965877 -0.664424 0.375763
Cl 4.399062 0.313481 2.175767
C  -0.355982 -0.19397 -0.121013
C  1.130331 -0.059285 -0.281603
C  -1.205529 0.943954 -0.071826
C  -0.987598 -1.458354 -0.011691
C  1.952737 0.049314 0.866973
C  1.713797 -0.044594 -1.572781
C  -2.610245 0.833934 0.077144
C  -2.377988 -1.607381 0.138809
C  -3.182591 -0.45434 0.182224
C  3.344047 0.171892 0.696982
C  3.113448 0.079214 -1.713535
C  3.945765 0.189215 -0.576314
H  1.51562 0.040396 1.869713
H  1.075755 -0.127849 -2.458459
H  -2.82994 -2.598441 0.22147
H  3.564788 0.090939 -2.711159
H  5.030734 0.285738 -0.676868
