program: Gaussian 09
title: 000093646
version: EM64L-G09RevD.01
frameworkgroup: C1[X(C20H14Cl2N8O10S3)]
method: RPBEPBE
basis: SDD
operation: Freq
keyword: #p
keyword: freq=noraman
keyword: PBEPBE/SDD
title: #p freq=noraman PBEPBE/SDD
converged: YES YES NO NO
title: Mulliken charges:
elementType: Cl Cl S S S O O O O O O O O O O N N N N N N N N C C C C C C C C C C C C C C C C C C C C H H H H H H H H H H H H H H
charge: 0.068665 0.048183 0.982152 0.996977 1.001412 -0.543916 -0.560388 -0.554058 -0.468719 -0.562611 -0.483751 -0.480877 -0.500445 -0.480392 -0.274797 -0.093370 -0.128387 -0.448681 -0.415873 -0.680216 -0.006442 0.014214 0.124216 0.553028 0.463720 -0.225200 -0.099301 -0.414117 -0.334152 -0.449445 -0.408020 -0.265746 0.280645 -0.029242 0.345247 0.556213 -0.251558 -0.441388 -0.474179 0.112867 0.236446 -0.237540 -0.266057 0.308557 0.312568 0.297322 0.333579 0.393714 0.391968 0.385138 0.296804 0.394064 0.238812 0.351688 0.356167 0.390462 0.344038
chargesum: 0.00000
title: Mulliken charges with hydrogens summed into heavy atoms:
elementType: Cl Cl S S S O O O O O O O O O O N N N N N N N N C C C C C C C C C C C C C C C C C C C C
charge: 0.068665 0.048183 0.982152 0.996977 1.001412 -0.150202 -0.168420 -0.168920 -0.468719 -0.562611 -0.483751 -0.480877 -0.500445 -0.480392 -0.274797 -0.093370 -0.128387 -0.096993 -0.059706 0.054284 -0.006442 0.014214 0.124216 0.553028 0.463720 -0.225200 -0.099301 -0.105560 -0.334152 -0.136877 -0.110697 0.067833 0.280645 -0.029242 0.345247 0.556213 0.045246 -0.047324 -0.235367 0.112867 0.236446 -0.237540 -0.266057
polarizability: 1.11927892e+03 2.74244605e+01 4.99503633e+02 9.56083373e+00 1.83888099e+01 2.07290937e+02
1716.lowfreq: -0.6197 -0.0021 0.0008 0.0011 2.1367 4.0009 10.3527 14.0460 20.3197
frequency: 10.3369 14.0309 20.3196 25.8741 26.6302 28.0410 39.8924 42.2735 47.7519 56.0994 68.4819 71.6215 83.2421 93.8882 95.8306 100.6692 102.4418 107.1273 115.5658 122.2615 127.7366 141.3152 151.6233 158.8045 164.4016 166.2254 171.1846 178.7978 180.1703 191.7782 195.0464 211.0926 214.8089 224.7786 225.1130 241.9750 254.9579 256.2453 268.3174 271.6356 281.8939 290.8481 302.8214 313.6755 317.0267 320.1140 331.0865 336.6279 344.8089 363.5433 371.9239 391.4307 396.8116 407.7681 413.7610 423.6161 426.2373 438.0330 449.8843 458.1965 497.5972 512.4795 522.3204 532.1590 533.6068 540.5326 546.7874 565.6650 573.5354 588.8945 605.8547 609.3418 616.1627 621.6890 636.0934 650.3987 667.9234 674.8007 697.1221 698.0078 721.8142 732.1176 740.3905 754.2184 771.3410 774.8729 796.0667 804.5834 812.2024 820.1563 831.6284 832.9482 835.2327 839.7063 843.2177 867.6770 882.7598 905.8604 912.2939 928.5922 931.6236 936.7894 955.7138 960.5281 962.5616 972.3712 975.1315 977.4228 982.9498 987.5325 994.3655 1049.6894 1052.0855 1059.7953 1078.4652 1080.1093 1118.4839 1140.5764 1156.0907 1186.8621 1189.3550 1199.5740 1213.4506 1220.1567 1250.8618 1261.3105 1274.3328 1285.3416 1298.6825 1314.0312 1343.5044 1352.0535 1376.8459 1389.3707 1409.4696 1418.9979 1432.0694 1439.3711 1471.9908 1482.1808 1487.0109 1501.4426 1504.1097 1538.1135 1543.7178 1573.2032 1588.2515 1614.7170 1626.1371 1637.7247 1667.0878 3130.8125 3143.4903 3144.4155 3149.4777 3168.4182 3195.7506 3197.1463 3387.3525 3420.0359 3470.5208 3477.5936 3482.1299 3506.4114 3652.4421
redmass: 12.4394 20.0011 12.7976 9.0214 9.8610 13.6323 10.6347 8.1214 9.4441 13.8677 7.9095 10.9193 11.1789 7.7485 7.1494 7.0609 5.4386 5.3251 1.9993 4.2712 9.9253 13.4658 9.1648 7.6308 11.9883 6.3517 5.7620 3.9466 3.1113 8.2492 5.4173 2.2361 3.1658 6.7601 6.3349 4.8690 5.7402 7.6853 6.8012 6.0985 3.8461 6.0179 6.3317 9.6883 8.1015 9.7512 9.6319 10.8192 8.9441 5.7155 5.2579 12.8226 13.3549 11.5183 6.5137 10.3478 10.6355 13.0513 8.5827 3.7426 3.7402 6.2495 7.7894 2.7633 1.7329 5.2027 12.0937 4.1907 7.0527 8.4042 6.9928 5.4457 6.0933 11.4396 3.8418 4.1381 7.0346 8.9460 5.3940 1.4534 4.2499 1.7180 4.1553 7.8928 4.1008 5.7086 6.5455 2.3146 8.6307 6.5360 1.6128 10.5550 10.1183 8.4400 1.3063 7.6172 13.3714 5.0352 1.4096 1.7220 2.7921 2.1337 7.9873 11.3757 6.2285 6.5372 2.1755 1.3168 1.3612 4.5026 2.6719 1.1686 1.1694 1.2187 1.9704 1.8751 2.2547 2.0911 4.5124 5.6141 2.6196 2.1017 2.2459 1.7105 5.0628 1.7077 3.2137 1.9754 2.8927 3.0066 4.4043 4.1627 4.1667 4.2985 2.9324 6.5377 7.7851 7.1441 4.1375 4.7118 4.8504 4.2572 4.0337 4.2509 5.8645 2.7957 7.8133 7.3155 5.6794 1.4039 3.1975 1.0899 1.0931 1.0927 1.0932 1.0963 1.0902 1.0936 1.0750 1.0588 1.0662 1.0662 1.0663 1.0755 1.0941
irintensity: 0.1426 0.3368 0.1995 0.8018 1.6420 0.3397 0.4525 0.8306 0.0459 0.7994 1.6605 0.3153 0.9356 2.8063 1.2753 1.3955 6.4876 8.7732 71.2774 26.3531 2.3635 0.1054 0.6392 7.8406 0.1487 2.4553 12.1886 15.9758 38.1295 1.0443 1.2498 33.2077 2.8576 5.3050 24.2694 19.9144 54.3152 6.5043 2.1373 49.4142 53.2063 13.5768 25.7431 20.5525 16.0978 8.9702 6.9699 9.5327 0.3817 7.5561 1.9067 13.9537 21.4345 117.5644 13.8127 9.4351 126.9706 29.3142 17.6845 9.1707 2.4816 9.1496 7.0532 16.7133 205.3715 189.6612 20.9729 53.6945 11.3691 56.4100 18.3309 37.5870 47.3830 0.9722 13.0675 8.1121 32.2485 79.6325 25.8558 142.6505 0.8239 43.5064 2.4968 16.5132 3.3322 25.9802 11.3947 14.8912 93.1815 21.7074 94.7019 114.3093 102.1553 87.8114 125.4591 4.7554 12.3626 16.8248 1.1840 45.1400 11.9065 11.1066 152.9032 77.2753 60.5817 78.0516 27.8230 37.9763 1.5937 28.9168 27.6292 48.9355 116.7593 71.3710 142.5960 37.9094 344.2259 98.0613 56.5134 1128.0586 132.0118 78.7263 345.2371 143.1669 71.6398 18.9502 372.3986 272.5551 12.0347 257.6519 1660.8227 172.2607 141.9738 271.2403 61.8407 2.5094 124.1136 524.9573 412.5932 125.8748 226.6620 1487.0029 290.4468 352.2664 316.2229 1030.0168 4.4571 226.7369 65.5726 19.2371 329.9383 12.8445 36.0660 15.6822 14.2116 8.9685 2.9509 39.7635 13.2319 189.3902 54.9080 71.5252 46.6748 69.3581 105.9923
temp: 298.150 k
press: 1.00000 atm
elementType: 17 17 16 16 16 8 8 8 8 8 8 8 8 8 8 7 7 7 7 7 7 7 7 6 6 6 6 6 6 6 6 6 6 6 6 6 6 6 6 6 6 6 6 1 1 1 1 1 1 1 1 1 1 1 1 1 1
symmnumber: 1
zpe: 908783.6 jmol-1
zpe.correction: 0.346137 hartree
zpe.thermalcorrener: 0.389075 hartree
zpe.thermalcorrenthalpy: 0.390019 hartree
zpe.thermalcorrgfe: 0.265205 hartree
zpe.sumelectzpe: -4071.470595 hartree
zpe.sumelectthermal: -4071.427658 hartree
zpe.sumelectthermalent: -4071.426714 hartree
zpe.sumelectthermalfe: -4071.551528 hartree
dipole: -0.2481 0.6938 2.3192
dipole: 2.4334
quadrupole: -333.3759 -299.5228 -286.2672
quadrupole: 29.6685 -14.5430 -16.5753
quadrupole: -26.9873 6.8658 20.1215 29.6685 -14.5430 -16.5753
hfenergy: -4071.8167326 hartree
pointgroup: C01 [X(C20H14Cl2N8O10S3)]
dipole: 0.0717111 -0.2940603 0.908274 debye
polarizability: 1120.5831636|-3.6881501|498.8720846|1.4847986|-12.6358813|206.6182391 unknown
InChI: InChI=1S/C20H14Cl2N8O10S3/c21-17-26-18(22)28-20(27-17)24-9-1-2-12(13(5-9)25-19(23)31)29-30-14-7-11-8(4-16(14)43(38,39)40)3-10(41(32,33)34)6-15(11)42(35,36)37/h1-7,24-25,32,35,38H,23H2
charge 0 multiplicity 1
57 atoms
Cl -7.394428 3.719018 -0.651691
Cl -10.818826 -0.333747 0.168166
S  3.23329 2.805976 0.402526
S  8.376094 0.760092 -0.198393
S  2.234844 -4.469585 -0.252989
O  2.851814 2.460975 2.175686
O  8.658697 0.788131 1.632933
O  1.522857 -4.256122 -1.949515
O  4.13262 4.136203 0.266075
O  1.832699 2.725125 -0.419197
O  9.097867 -0.537251 -0.836081
O  8.629016 2.243428 -0.787666
O  3.581901 -5.361169 -0.351106
O  1.076471 -4.929522 0.771685
O  -3.234358 3.078899 -0.758505
N  0.475037 -1.922836 0.050222
N  -0.273114 -0.841672 -0.075723
N  -1.601017 1.390211 -0.462134
N  -5.873216 -1.062557 0.136076
N  -0.956188 3.598978 -0.83577
N  -8.15223 -0.645539 0.13546
N  -6.597525 1.193169 -0.237516
N  -8.987018 1.597165 -0.22979
C  3.755147 -0.033928 0.105613
C  4.694054 -1.1370 -0.063264
C  4.327186 1.280358 0.175524
C  6.538287 0.438007 -0.06166
C  6.094852 -0.875725 -0.135552
C  2.808459 -2.670139 -0.099014
C  4.176213 -2.470058 -0.154233
C  2.368074 -0.301838 0.171107
C  5.683413 1.55811 0.098406
C  1.858249 -1.609216 0.03685
C  -1.648511 -0.975508 -0.01801
C  -2.379721 0.266533 -0.227352
C  -4.46734 -0.947766 0.068572
C  -2.360544 -2.188847 0.230944
C  -3.797945 0.269766 -0.181308
C  -3.748192 -2.179659 0.275421
C  -6.874258 -0.126599 0.003041
C  -2.02162 2.727773 -0.692701
C  -7.688704 1.979823 -0.339377
C  -9.131163 0.264478 0.007659
H  6.812008 -1.693691 -0.268471
H  4.849032 -3.326465 -0.276706
H  1.645852 0.504756 0.29972
H  6.07579 2.581063 0.136831
H  2.316168 3.225561 2.540691
H  9.615597 1.034572 1.7984
H  0.934886 -5.046336 -2.130128
H  -1.782055 -3.104074 0.389401
H  -4.344318 1.199373 -0.340582
H  -4.301765 -3.105808 0.470097
H  -0.592517 1.174375 -0.464106
H  -6.248253 -2.000028 0.316119
H  0.031574 3.330726 -0.750198
H  -1.189522 4.56864 -1.038086
