program: Gaussian 09
title: 000093391
version: EM64L-G09RevD.01
frameworkgroup: C1[X(C10H22O2)]
method: RPBEPBE
basis: SDD
operation: Freq
keyword: #pfreq=noraman
keyword: PBEPBE/SDD
title: #p freq=noraman PBEPBE/SDD
converged: YES YES NO NO
title: Mulliken charges:
elementType: O O C C C C C C C C C C H H H H H H H H H H H H H H H H H H H H H H
charge: -0.271248 -0.438320 -0.376788 -0.373722 -0.377567 -0.368461 -0.395611 -0.398284 -0.272310 -0.330033 -0.202991 -0.677966 0.195895 0.194566 0.191454 0.195359 0.190129 0.188995 0.191319 0.195712 0.210990 0.211475 0.217808 0.185096 0.182789 0.183196 0.182488 0.216131 0.182864 0.182641 0.328694 0.200256 0.227629 0.227815
chargesum: 0.00000
title: Mulliken charges with hydrogens summed into heavy atoms:
elementType: O O C C C C C C C C C C
charge: -0.271248 -0.109625 0.013673 0.013091 0.001558 0.018570 0.026854 0.004619 0.093675 0.068586 0.162514 -0.022266
polarizability: 1.58839352e+02 -1.85547697e+00 1.02324271e+02 -3.40807487e-01 1.37285687e+00 9.58989451e+01
1716.lowfreq: -1.4459 -0.0008 0.0008 0.0014 7.2325 23.3558 33.5605 37.3358 54.8091
frequency: 24.3411 36.2815 50.9948 56.7212 86.5674 94.5834 97.3176 119.3119 136.6161 150.8661 160.0388 174.4087 183.4410 240.4622 268.8792 314.6184 349.7344 382.2163 456.3186 485.7809 507.1120 725.2775 737.7127 763.9255 802.1167 815.9757 838.5831 862.0641 933.2715 947.1968 980.0501 1004.5318 1007.8186 1012.8962 1048.8989 1059.5805 1072.1171 1076.0478 1082.3103 1088.1054 1106.1316 1129.5563 1131.2727 1159.5416 1199.3712 1212.2321 1236.8523 1249.3540 1252.7249 1269.4204 1278.7331 1283.0878 1290.4373 1297.1153 1298.6729 1320.5355 1338.2742 1349.6619 1358.8612 1360.1063 1382.8355 1389.6841 1407.6589 1459.5362 1462.1288 1464.3345 1466.8018 1468.9609 1473.4338 1478.2842 1482.7259 1487.0346 1490.4494 1497.0933 2897.9437 2912.9104 2945.2427 2945.7454 2952.5428 2953.8330 2954.4311 2955.9644 2960.4070 2967.4426 2987.5306 2991.1595 2993.3204 2995.5664 3010.7569 3028.7532 3041.8234 3057.6983 3073.5101 3090.4792 3100.8566 3557.1672
redmass: 4.1246 4.3599 1.6317 3.8449 1.5931 4.0291 3.6609 1.6916 3.0888 1.8899 2.2653 3.7212 4.9905 1.1611 3.0682 1.1926 3.8900 3.3238 3.5065 3.1435 3.2159 1.0643 1.0841 1.1086 1.1473 1.0912 2.8589 1.2043 1.4126 3.2352 4.4590 2.8564 1.6285 2.6448 3.4566 3.0813 4.1902 2.1264 2.3872 2.0204 1.7135 2.4646 1.3614 1.4951 1.5618 1.2629 1.3807 1.1566 1.2842 1.2142 1.1315 1.0689 1.2241 1.0894 1.1459 1.2790 1.2840 1.3689 1.6924 1.5408 1.2588 1.2453 1.4708 1.0410 1.0760 1.0699 1.0731 1.0762 1.0844 1.0763 1.0750 1.0886 1.0962 1.0834 1.0545 1.0547 1.1054 1.0690 1.0588 1.0592 1.1065 1.0609 1.0619 1.0602 1.0964 1.0590 1.0360 1.0988 1.1009 1.1008 1.1018 1.1043 1.0976 1.0990 1.1009 1.0661
irintensity: 0.3116 0.2058 3.0496 2.9846 2.0215 1.3344 1.1111 1.2709 6.5890 0.6311 0.7345 0.0915 0.0913 0.7691 2.1276 149.2487 15.9282 3.8775 9.3996 2.5654 2.3792 13.4153 0.1169 5.1249 1.4027 3.9246 6.4619 2.5362 26.3603 47.8991 25.7185 9.5045 3.2428 13.7219 4.8821 18.6104 126.7938 9.3445 20.4325 5.2425 34.7426 14.9059 1.8999 7.1354 6.6209 17.3327 2.0201 0.3053 1.1664 1.6226 2.2987 0.8753 0.6283 0.0609 0.4620 12.1117 7.0817 29.7735 0.3610 0.6528 25.5096 23.7055 1.8734 10.6997 0.0984 0.1853 0.2586 1.9751 4.6110 5.0309 2.4600 3.5060 15.8037 9.3908 28.3198 115.2642 62.7558 55.4787 9.2486 0.6947 59.2652 6.2770 1.1024 166.4685 1.2674 44.0165 29.4576 4.1283 2.8197 8.7801 83.6260 115.8530 68.4231 38.3895 39.5873 6.6704
temp: 298.150 k
press: 1.00000 atm
elementType: 8 8 6 6 6 6 6 6 6 6 6 6 1 1 1 1 1 1 1 1 1 1 1 1 1 1 1 1 1 1 1 1 1 1
symmnumber: 1
zpe: 802353.8 jmol-1
zpe.correction: 0.305600 hartree
zpe.thermalcorrener: 0.322015 hartree
zpe.thermalcorrenthalpy: 0.322959 hartree
zpe.thermalcorrgfe: 0.259477 hartree
zpe.sumelectzpe: -543.654207 hartree
zpe.sumelectthermal: -543.637792 hartree
zpe.sumelectthermalent: -543.636848 hartree
zpe.sumelectthermalfe: -543.700330 hartree
dipole: 1.8039 1.6791 1.2991
dipole: 2.7859
quadrupole: -95.5337 -76.5980 -74.8582
quadrupole: 4.5615 -10.2060 1.5290
quadrupole: -13.2037 5.7320 7.4718 4.5615 -10.2060 1.5290
hfenergy: -543.9598074 hartree
pointgroup: C01 [X(C10H22O2)]
dipole: -0.7099234 0.6516678 -0.5221912 debye
polarizability: 158.8448763|1.6987944|102.2554244|-0.6060275|-1.5102181|95.9622673 unknown
InChI: InChI=1S/C10H22O2/c1-2-12-10-8-6-4-3-5-7-9-11/h11H,2-10H2,1H3
charge 0 multiplicity 1
34 atoms
O  -4.411986 -0.284783 0.00526
O  6.989055 0.196372 0.026447
C  0.586314 -0.383644 -0.003138
C  1.904462 0.422243 -0.007263
C  -0.674154 0.510008 -0.000272
C  3.164273 -0.472849 -0.009698
C  -1.987433 -0.30466 0.002405
C  4.482778 0.334876 -0.012346
C  -3.232255 0.587722 0.00555
C  5.729614 -0.567367 -0.016605
C  -5.671117 0.471693 0.010854
C  -6.818187 -0.538497 0.010986
H  0.565342 -1.048582 0.885307
H  0.560189 -1.050368 -0.890269
H  1.925408 1.08726 -0.896052
H  1.93069 1.088681 0.879934
H  -0.646958 1.175279 0.888297
H  -0.650903 1.175896 -0.888611
H  3.135336 -1.14105 -0.896091
H  3.142845 -1.136594 0.879591
H  -2.027528 -0.963639 -0.886445
H  -2.023337 -0.964214 0.890959
H  4.524916 0.994332 0.87647
H  4.504279 0.9979 -0.904113
H  -3.245319 1.247002 -0.893621
H  -3.24331 1.243553 0.907213
H  5.709387 -1.244894 -0.898875
H  5.761716 -1.189746 0.894041
H  -5.714681 1.125019 0.912247
H  -5.719522 1.130348 -0.886427
H  7.026891 0.787195 -0.768135
H  -7.793963 -0.018999 0.015339
H  -6.765009 -1.180447 -0.885164
H  -6.759934 -1.185847 0.902922
